{"text_format":"1","workbook":"xlsx","n_sheets":8,"sheets":["datos","IND.","PAR","TER","cuarteto","T EVENTO","EVENTO PAIS","ROUND ROBIN"],"not_rendered":{"charts":0,"images":1,"macros":1,"external_links":0,"defined_names":8,"comments":0,"pivot_tables":0},"unopened":[],"bounds":{"document_bytes":16777216,"sheet_cells":100000,"rows_first":2000,"rows_last":500,"rows_between":2000,"halvings":0,"cell_chars":16384,"cell_head_chars":4096},"cells_cut":0,"cells_raw":0,"read":"whole","date_system":"1900"}

{"sheet":"datos","index":0,"n_rows":53,"n_cols":35,"rows_kept":53,"cut":false,"hidden":true,"merged":[]}
[null,"solamente carga de datos"]
[null,null,null,null,null,null,null,null,null,null,null,null,null,null,null,null,null," "]
[null,"Apellido y Nombre","FEDE","L1","L2","L3","L4","L5","L6","L7","L8","L9","L10","L11","L12","L13","L14","L15","L16","L17","L18","L19","L20","L21","L22","L23","L24","LIN","TOTAL","PROM"]
["j12","AGUSTIN LEANDRO A.","Argentina",184,165,165,203,178,172,147,210,171,219,157,188,138,177,180,184,221,153,188,199,195,181,191,245,{"$f":"COUNTIF(D4:AA4,\">0\")","v":24},{"$f":"SUM(D4:AA4)","v":4411},{"$f":"AC4/AB4","v":183.79166666666666},null,null,null,null,1]
["j13","FRANCO R. GUALINI","Argentina",200,185,192,204,177,215,168,172,180,188,182,198,187,160,229,203,189,224,178,234,156,226,162,155,24,4564,{"$f":"AC5/AB5","v":190.16666666666666},null,null,null,null,2]
["j14","FABRICIO E. SANDUAY","Argentina",140,150,204,211,146,194,170,171,157,168,178,125,202,162,161,176,211,194,203,171,209,178,126,179,24,4186,174.41666666666666,null,null,null,null,3]
["j15","FERNANDO TAPIA M.","Argentina",193,223,180,214,183,161,205,180,149,157,176,187,206,182,179,201,202,171,251,171,184,192,165,181,24,4493,187.20833333333334,null,null,null,null,4]
["j16","BRIAN HELMEYER","Aruba",176,217,155,238,174,192,177,172,193,200,235,184,227,245,187,197,211,167,185,233,188,185,203,188,24,4729,197.04166666666666,null,null,null,null,5]
["j17","YANNICK ROOS","Aruba",162,206,207,204,193,182,187,147,135,143,161,158,195,180,193,182,233,200,178,195,172,212,212,192,24,4429,184.54166666666666,null,null,null,null,6]
["j18","OSMAR BISLIP","Aruba",205,195,162,164,192,168,205,159,158,200,145,175,163,172,161,181,193,256,159,195,172,158,221,173,24,4332,180.5,null,null,null,null,7]
["j19","ELIAS HALABI","Aruba",202,155,220,142,206,207,202,154,173,186,182,126,178,167,178,210,170,188,171,171,227,229,159,194,24,4397,183.20833333333334,null,null,null,null,8]
["j20","BRUNO COSTA S","Brasil",202,265,214,185,211,233,178,200,213,210,202,247,182,277,225,254,267,213,221,190,222,162,172,203,24,5148,214.5,null,null,null,null,9]
["j21","BERNARDO ABREU","Brasil",180,177,175,190,194,173,176,154,194,131,169,165,184,216,162,200,194,225,150,176,181,156,193,205,24,4320,180,null,null,null,null,10]
["j22","THIAGO FELICETTI","Brasil",183,157,211,224,154,234,134,214,235,173,133,173,180,184,233,235,180,162,210,158,227,161,145,171,24,4471,186.29166666666666,null,null,null,null,11]
["j23","JOAO I. FERREIRA N. ","Brasil",199,141,169,183,214,201,157,173,200,192,156,203,212,200,256,156,186,194,148,212,143,190,194,192,24,4471,186.29166666666666,null,null,null,null,12]
["j24","CARLOS F. SAAVEDRA","Colombia",192,233,245,199,244,193,154,175,164,160,149,204,150,204,217,227,197,194,164,167,233,185,173,213,24,4636,193.16666666666666,null,null,null,null,13]
["j25","SEBASTIAN DONADO","Colombia",231,201,195,222,152,155,173,197,200,157,214,202,215,204,238,203,157,201,170,160,168,175,206,210,24,4606,191.91666666666666,null,null,null,null,14]
["j26","SEBASTIAN CHARRY","Colombia",223,223,162,246,227,257,225,199,174,169,191,195,168,239,211,216,198,193,215,176,178,203,224,186,24,4898,204.08333333333334,null,null,null,null,15]
["j27","JORGE FIGUEROA","Colombia",216,214,224,233,169,207,242,148,216,212,184,175,219,175,223,243,214,182,152,224,183,226,236,204,24,4921,205.04166666666666,null,null,null,null,16]
["j28","BASTIAN MALDONADO R.","Chile",226,169,153,184,189,195,201,148,130,165,165,152,182,162,222,234,182,187,148,167,205,200,209,161,24,4336,180.66666666666666,null,null,null,null,17]
["j29","MATIAS NAZAR G.","Chile",157,167,182,159,149,160,141,212,189,195,175,165,199,158,180,212,145,144,156,160,160,185,167,162,24,4079,169.95833333333334,null,null,null,null,18]
["j30","IVAN VELIZ H.","Chile",158,133,123,158,137,112,154,144,168,169,158,114,131,153,110,177,145,142,150,163,144,168,155,95,24,3461,144.20833333333334,null,null,null,null,19]
["j31","LUIS JEREZ G.","Chile",154,116,117,116,103,103,155,159,116,128,103,144,125,115,89,133,176,151,157,124,166,125,123,126,24,3124,130.16666666666666,null,null,null,null,20]
["j32","ADRIAN GUIBU K.","Perú",170,142,139,166,269,193,133,146,224,161,149,191,177,196,172,151,200,148,156,158,222,222,195,191,24,4271,177.95833333333334,null,null,null,null,21]
["j33","JUAN ANDRES YUZURIHA","Perú",145,190,181,202,213,189,213,183,159,183,207,205,233,188,188,170,164,175,186,187,222,211,234,171,24,4599,191.625,null,null,null,null,22]
["j34","KEIJI M. CAJACHACAHUA M.","Perú",178,198,183,127,164,150,176,155,147,140,170,206,245,187,166,169,234,206,134,138,134,139,135,200,24,4081,170.04166666666666,null,null,null,null,23]
["j35","RENZO GUIBU K.","Perú",214,214,232,224,192,211,154,181,145,199,184,189,148,211,157,178,138,188,233,168,200,179,154,167,24,4460,185.83333333333334,null,null,null,null,24]
["j36","MATIAS DA MOTTA L.","Uruguay",125,158,139,147,124,151,134,200,148,138,189,186,147,157,144,137,195,137,174,205,111,125,146,139,24,3656,152.33333333333334,null,null,null,null,25]
["j37","ALFONSO RODRIGUEZ L.","Uruguay",163,160,107,130,180,151,154,158,148,128,142,132,194,137,128,112,121,144,139,156,130,151,131,167,24,3463,144.29166666666666,null,null,null,null,26]
["j38","FELIPE FUENTES F.","Uruguay",150,125,174,191,152,140,123,146,138,130,154,125,146,130,108,154,142,194,157,184,211,131,168,161,24,3634,151.41666666666666,null,null,null,null,27]
[null,null,null,null,null,null,null,null,null,null,null,null,null,null,null,null,null,null,null,null,null,null,null,null,null,null,null,0,0,{"$error":"#DIV/0!"}]
[null,null,null,null,null,null,null,null,null,null,null,null,null,null,null,null,null,null,null,null,null,null,null,null,null,null,null,0,0,{"$error":"#DIV/0!"}]
[null,null,null,null,null,null,null,null,null,null,null,null,null,null,null,null,null,null,null,null,null,null,null,null,null,null,null,0,0,{"$error":"#DIV/0!"}]
[null,null,null,null,null,null,null,null,null,null,null,null,null,null,null,null,null,null,null,null,null,null,null,null,null,null,null,0,0,{"$error":"#DIV/0!"}]
[null,null,null,null,null,null,null,null,null,null,null,null,null,null,null,null,null,null,null,null,null,null,null,null,null,null,null,0,0,{"$error":"#DIV/0!"}]
[null,null,null,null,null,null,null,null,null,null,null,null,null,null,null,null,null,null,null,null,null,null,null,null,null,null,null,0,0,{"$error":"#DIV/0!"}]
[null,null,null,null,null,null,null,null,null,null,null,null,null,null,null,null,null,null,null,null,null,null,null,null,null,null,null,0,0,{"$error":"#DIV/0!"}]
[null,null,null,null,null,null,null,null,null,null,null,null,null,null,null,null,null,null,null,null,null,null,null,null,null,null,null,{"$f":"COUNTIF(D38:AA38,\">0\")","v":0},{"$f":"SUM(D38:AA38)","v":0},{"$error":"#DIV/0!"}]
[null,null,null,null,null,null,null,null,null,null,null,null,null,null,null,null,null,null,null,null,null,null,null,null,null,null,null,0,0,{"$error":"#DIV/0!"}]
[null,null,null,null,null,null,null,null,null,null,null,null,null,null,null,null,null,null,null,null,null,null,null,null,null,null,null,0,0,{"$error":"#DIV/0!"}]
[null,null,null,null,null,null,null,null,null,null,null,null,null,null,null,null,null,null,null,null,null,null,null,null,null,null,null,0,0,{"$error":"#DIV/0!"}]
[null,null,null,null,null,null,null,null,null,null,null,null,null,null,null,null,null,null,null,null,null,null,null,null,null,null,null,0,0,{"$error":"#DIV/0!"}]
[null,null,null,null,null,null,null,null,null,null,null,null,null,null,null,null,null,null,null,null,null,null,null,null,null,null,null,0,0,{"$error":"#DIV/0!"}]
[null,null,null,null,null,null,null,null,null,null,null,null,null,null,null,null,null,null,null,null,null,null,null,null,null,null,null,0,0,{"$error":"#DIV/0!"}]
[null,null,null,null,null,null,null,null,null,null,null,null,null,null,null,null,null,null,null,null,null,null,null,null,null,null,null,0,0,{"$error":"#DIV/0!"}]
[null,null,null,null,null,null,null,null,null,null,null,null,null,null,null,null,null,null,null,null,null,null,null,null,null,null,null,0,0,{"$error":"#DIV/0!"}]
[null,null,null,null,null,null,null,null,null,null,null,null,null,null,null,null,null,null,null,null,null,null,null,null,null,null,null,0,0,{"$error":"#DIV/0!"}]
[null,null,null,null,null,null,null,null,null,null,null,null,null,null,null,null,null,null,null,null,null,null,null,null,null,null,null,0,0,{"$error":"#DIV/0!"}]
[null,null,null,null,null,null,null,null,null,null,null,null,null,null,null,null,null,null,null,null,null,null,null,null,null,null,null,0,0,{"$error":"#DIV/0!"}]
[null,null,null,null,null,null,null,null,null,null,null,null,null,null,null,null,null,null,null,null,null,null,null,null,null,null,null,0,0,{"$error":"#DIV/0!"}]
[null,null,null,null,null,null,null,null,null,null,null,null,null,null,null,null,null,null,null,null,null,null,null,null,null,null,null,{"$f":"COUNTIF(D51:AA51,\">0\")","v":0},{"$f":"SUM(D51:AA51)","v":0},{"$f":"AC51/AB51","v":{"$error":"#DIV/0!"}}]
[null,null,null,null,null,null,null,null,null,null,null,null,null,null,null,null,null,null,null,null,null,null,null,null,null,null,null,0,0,{"$error":"#DIV/0!"}]
[1,2,3,4,5,6,7,8,9,10,11,12,13,14,15,16,17,18,19,20,21,22,23,24,25,26,27,28,29,30]

{"sheet":"IND.","index":1,"n_rows":32,"n_cols":14,"rows_kept":32,"cut":false,"hidden":false,"merged":[[3,1,3,13],[1,0,1,13],[2,0,2,13]]}
[]
["CAMPEONATO SUDAMERICANO JUVENIL 2014"]
["INDVIDUAL SUB 20"]
[]
["Cod","Nombre del Jugador","FEDERACION","L1","L2","L3","L4","L5","L6","total","lin","Prom","Pos.","dif"]
["j26",{"$f":"VLOOKUP($A6,datos!$A$4:$AD$52,2)","v":"SEBASTIAN CHARRY"},{"$f":"VLOOKUP($A6,datos!$A$4:$AD$52,3)","v":"Colombia"},{"$f":"VLOOKUP($A6,datos!$A$4:$AD$52,4)","v":223},{"$f":"VLOOKUP($A6,datos!$A$4:$AD$52,5)","v":223},{"$f":"VLOOKUP($A6,datos!$A$4:$AD$52,6)","v":162},{"$f":"VLOOKUP($A6,datos!$A$4:$AD$52,7)","v":246},{"$f":"VLOOKUP($A6,datos!$A$4:$AD$52,8)","v":227},{"$f":"VLOOKUP($A6,datos!$A$4:$AD$52,9)","v":257},{"$f":"SUM(D6:I6)","v":1338},{"$f":"COUNTIF(D6:I6,\">0\")","v":6},{"$f":"J6/K6","v":223},"1°",{"$f":"MAX($J$6:$J$32)-J6","v":0}]
["j20",{"$f":"VLOOKUP($A7,datos!$A$4:$AD$52,2)","v":"BRUNO COSTA S"},{"$f":"VLOOKUP($A7,datos!$A$4:$AD$52,3)","v":"Brasil"},{"$f":"VLOOKUP($A7,datos!$A$4:$AD$52,4)","v":202},{"$f":"VLOOKUP($A7,datos!$A$4:$AD$52,5)","v":265},{"$f":"VLOOKUP($A7,datos!$A$4:$AD$52,6)","v":214},{"$f":"VLOOKUP($A7,datos!$A$4:$AD$52,7)","v":185},{"$f":"VLOOKUP($A7,datos!$A$4:$AD$52,8)","v":211},{"$f":"VLOOKUP($A7,datos!$A$4:$AD$52,9)","v":233},1310,6,218.33333333333334,"2°",28]
["j24",{"$f":"VLOOKUP($A8,datos!$A$4:$AD$52,2)","v":"CARLOS F. SAAVEDRA"},{"$f":"VLOOKUP($A8,datos!$A$4:$AD$52,3)","v":"Colombia"},{"$f":"VLOOKUP($A8,datos!$A$4:$AD$52,4)","v":192},{"$f":"VLOOKUP($A8,datos!$A$4:$AD$52,5)","v":233},{"$f":"VLOOKUP($A8,datos!$A$4:$AD$52,6)","v":245},{"$f":"VLOOKUP($A8,datos!$A$4:$AD$52,7)","v":199},{"$f":"VLOOKUP($A8,datos!$A$4:$AD$52,8)","v":244},{"$f":"VLOOKUP($A8,datos!$A$4:$AD$52,9)","v":193},1306,6,217.66666666666666,"3°",32]
["j35",{"$f":"VLOOKUP($A9,datos!$A$4:$AD$52,2)","v":"RENZO GUIBU K."},{"$f":"VLOOKUP($A9,datos!$A$4:$AD$52,3)","v":"Perú"},{"$f":"VLOOKUP($A9,datos!$A$4:$AD$52,4)","v":214},{"$f":"VLOOKUP($A9,datos!$A$4:$AD$52,5)","v":214},{"$f":"VLOOKUP($A9,datos!$A$4:$AD$52,6)","v":232},{"$f":"VLOOKUP($A9,datos!$A$4:$AD$52,7)","v":224},{"$f":"VLOOKUP($A9,datos!$A$4:$AD$52,8)","v":192},{"$f":"VLOOKUP($A9,datos!$A$4:$AD$52,9)","v":211},1287,6,214.5,"4°",51]
["j27",{"$f":"VLOOKUP($A10,datos!$A$4:$AD$52,2)","v":"JORGE FIGUEROA"},{"$f":"VLOOKUP($A10,datos!$A$4:$AD$52,3)","v":"Colombia"},{"$f":"VLOOKUP($A10,datos!$A$4:$AD$52,4)","v":216},{"$f":"VLOOKUP($A10,datos!$A$4:$AD$52,5)","v":214},{"$f":"VLOOKUP($A10,datos!$A$4:$AD$52,6)","v":224},{"$f":"VLOOKUP($A10,datos!$A$4:$AD$52,7)","v":233},{"$f":"VLOOKUP($A10,datos!$A$4:$AD$52,8)","v":169},{"$f":"VLOOKUP($A10,datos!$A$4:$AD$52,9)","v":207},1263,6,210.5,"5°",75]
["j13",{"$f":"VLOOKUP($A11,datos!$A$4:$AD$52,2)","v":"FRANCO R. GUALINI"},{"$f":"VLOOKUP($A11,datos!$A$4:$AD$52,3)","v":"Argentina"},{"$f":"VLOOKUP($A11,datos!$A$4:$AD$52,4)","v":200},{"$f":"VLOOKUP($A11,datos!$A$4:$AD$52,5)","v":185},{"$f":"VLOOKUP($A11,datos!$A$4:$AD$52,6)","v":192},{"$f":"VLOOKUP($A11,datos!$A$4:$AD$52,7)","v":204},{"$f":"VLOOKUP($A11,datos!$A$4:$AD$52,8)","v":177},{"$f":"VLOOKUP($A11,datos!$A$4:$AD$52,9)","v":215},1173,6,195.5,"6°",165]
["j22",{"$f":"VLOOKUP($A12,datos!$A$4:$AD$52,2)","v":"THIAGO FELICETTI"},{"$f":"VLOOKUP($A12,datos!$A$4:$AD$52,3)","v":"Brasil"},{"$f":"VLOOKUP($A12,datos!$A$4:$AD$52,4)","v":183},{"$f":"VLOOKUP($A12,datos!$A$4:$AD$52,5)","v":157},{"$f":"VLOOKUP($A12,datos!$A$4:$AD$52,6)","v":211},{"$f":"VLOOKUP($A12,datos!$A$4:$AD$52,7)","v":224},{"$f":"VLOOKUP($A12,datos!$A$4:$AD$52,8)","v":154},{"$f":"VLOOKUP($A12,datos!$A$4:$AD$52,9)","v":234},1163,6,193.83333333333334,"7°",175]
["j25",{"$f":"VLOOKUP($A13,datos!$A$4:$AD$52,2)","v":"SEBASTIAN DONADO"},{"$f":"VLOOKUP($A13,datos!$A$4:$AD$52,3)","v":"Colombia"},{"$f":"VLOOKUP($A13,datos!$A$4:$AD$52,4)","v":231},{"$f":"VLOOKUP($A13,datos!$A$4:$AD$52,5)","v":201},{"$f":"VLOOKUP($A13,datos!$A$4:$AD$52,6)","v":195},{"$f":"VLOOKUP($A13,datos!$A$4:$AD$52,7)","v":222},{"$f":"VLOOKUP($A13,datos!$A$4:$AD$52,8)","v":152},{"$f":"VLOOKUP($A13,datos!$A$4:$AD$52,9)","v":155},1156,6,192.66666666666666,"8°",182]
["j15",{"$f":"VLOOKUP($A14,datos!$A$4:$AD$52,2)","v":"FERNANDO TAPIA M."},{"$f":"VLOOKUP($A14,datos!$A$4:$AD$52,3)","v":"Argentina"},{"$f":"VLOOKUP($A14,datos!$A$4:$AD$52,4)","v":193},{"$f":"VLOOKUP($A14,datos!$A$4:$AD$52,5)","v":223},{"$f":"VLOOKUP($A14,datos!$A$4:$AD$52,6)","v":180},{"$f":"VLOOKUP($A14,datos!$A$4:$AD$52,7)","v":214},{"$f":"VLOOKUP($A14,datos!$A$4:$AD$52,8)","v":183},{"$f":"VLOOKUP($A14,datos!$A$4:$AD$52,9)","v":161},1154,6,192.33333333333334,"9°",184]
["j17",{"$f":"VLOOKUP($A15,datos!$A$4:$AD$52,2)","v":"YANNICK ROOS"},{"$f":"VLOOKUP($A15,datos!$A$4:$AD$52,3)","v":"Aruba"},{"$f":"VLOOKUP($A15,datos!$A$4:$AD$52,4)","v":162},{"$f":"VLOOKUP($A15,datos!$A$4:$AD$52,5)","v":206},{"$f":"VLOOKUP($A15,datos!$A$4:$AD$52,6)","v":207},{"$f":"VLOOKUP($A15,datos!$A$4:$AD$52,7)","v":204},{"$f":"VLOOKUP($A15,datos!$A$4:$AD$52,8)","v":193},{"$f":"VLOOKUP($A15,datos!$A$4:$AD$52,9)","v":182},1154,6,192.33333333333334,"10°",184]
["j16",{"$f":"VLOOKUP($A16,datos!$A$4:$AD$52,2)","v":"BRIAN HELMEYER"},{"$f":"VLOOKUP($A16,datos!$A$4:$AD$52,3)","v":"Aruba"},{"$f":"VLOOKUP($A16,datos!$A$4:$AD$52,4)","v":176},{"$f":"VLOOKUP($A16,datos!$A$4:$AD$52,5)","v":217},{"$f":"VLOOKUP($A16,datos!$A$4:$AD$52,6)","v":155},{"$f":"VLOOKUP($A16,datos!$A$4:$AD$52,7)","v":238},{"$f":"VLOOKUP($A16,datos!$A$4:$AD$52,8)","v":174},{"$f":"VLOOKUP($A16,datos!$A$4:$AD$52,9)","v":192},1152,6,192,"11°",186]
["j19",{"$f":"VLOOKUP($A17,datos!$A$4:$AD$52,2)","v":"ELIAS HALABI"},{"$f":"VLOOKUP($A17,datos!$A$4:$AD$52,3)","v":"Aruba"},{"$f":"VLOOKUP($A17,datos!$A$4:$AD$52,4)","v":202},{"$f":"VLOOKUP($A17,datos!$A$4:$AD$52,5)","v":155},{"$f":"VLOOKUP($A17,datos!$A$4:$AD$52,6)","v":220},{"$f":"VLOOKUP($A17,datos!$A$4:$AD$52,7)","v":142},{"$f":"VLOOKUP($A17,datos!$A$4:$AD$52,8)","v":206},{"$f":"VLOOKUP($A17,datos!$A$4:$AD$52,9)","v":207},1132,6,188.66666666666666,"12°",206]
["j33",{"$f":"VLOOKUP($A18,datos!$A$4:$AD$52,2)","v":"JUAN ANDRES YUZURIHA"},{"$f":"VLOOKUP($A18,datos!$A$4:$AD$52,3)","v":"Perú"},{"$f":"VLOOKUP($A18,datos!$A$4:$AD$52,4)","v":145},{"$f":"VLOOKUP($A18,datos!$A$4:$AD$52,5)","v":190},{"$f":"VLOOKUP($A18,datos!$A$4:$AD$52,6)","v":181},{"$f":"VLOOKUP($A18,datos!$A$4:$AD$52,7)","v":202},{"$f":"VLOOKUP($A18,datos!$A$4:$AD$52,8)","v":213},{"$f":"VLOOKUP($A18,datos!$A$4:$AD$52,9)","v":189},1120,6,186.66666666666666,"13°",218]
["j28",{"$f":"VLOOKUP($A19,datos!$A$4:$AD$52,2)","v":"BASTIAN MALDONADO R."},{"$f":"VLOOKUP($A19,datos!$A$4:$AD$52,3)","v":"Chile"},{"$f":"VLOOKUP($A19,datos!$A$4:$AD$52,4)","v":226},{"$f":"VLOOKUP($A19,datos!$A$4:$AD$52,5)","v":169},{"$f":"VLOOKUP($A19,datos!$A$4:$AD$52,6)","v":153},{"$f":"VLOOKUP($A19,datos!$A$4:$AD$52,7)","v":184},{"$f":"VLOOKUP($A19,datos!$A$4:$AD$52,8)","v":189},{"$f":"VLOOKUP($A19,datos!$A$4:$AD$52,9)","v":195},1116,6,186,"14°",222]
["j23",{"$f":"VLOOKUP($A20,datos!$A$4:$AD$52,2)","v":"JOAO I. FERREIRA N. "},{"$f":"VLOOKUP($A20,datos!$A$4:$AD$52,3)","v":"Brasil"},{"$f":"VLOOKUP($A20,datos!$A$4:$AD$52,4)","v":199},{"$f":"VLOOKUP($A20,datos!$A$4:$AD$52,5)","v":141},{"$f":"VLOOKUP($A20,datos!$A$4:$AD$52,6)","v":169},{"$f":"VLOOKUP($A20,datos!$A$4:$AD$52,7)","v":183},{"$f":"VLOOKUP($A20,datos!$A$4:$AD$52,8)","v":214},{"$f":"VLOOKUP($A20,datos!$A$4:$AD$52,9)","v":201},1107,6,184.5,"15°",231]
["j21",{"$f":"VLOOKUP($A21,datos!$A$4:$AD$52,2)","v":"BERNARDO ABREU"},{"$f":"VLOOKUP($A21,datos!$A$4:$AD$52,3)","v":"Brasil"},{"$f":"VLOOKUP($A21,datos!$A$4:$AD$52,4)","v":180},{"$f":"VLOOKUP($A21,datos!$A$4:$AD$52,5)","v":177},{"$f":"VLOOKUP($A21,datos!$A$4:$AD$52,6)","v":175},{"$f":"VLOOKUP($A21,datos!$A$4:$AD$52,7)","v":190},{"$f":"VLOOKUP($A21,datos!$A$4:$AD$52,8)","v":194},{"$f":"VLOOKUP($A21,datos!$A$4:$AD$52,9)","v":173},1089,6,181.5,"16°",249]
["j18",{"$f":"VLOOKUP($A22,datos!$A$4:$AD$52,2)","v":"OSMAR BISLIP"},{"$f":"VLOOKUP($A22,datos!$A$4:$AD$52,3)","v":"Aruba"},{"$f":"VLOOKUP($A22,datos!$A$4:$AD$52,4)","v":205},{"$f":"VLOOKUP($A22,datos!$A$4:$AD$52,5)","v":195},{"$f":"VLOOKUP($A22,datos!$A$4:$AD$52,6)","v":162},{"$f":"VLOOKUP($A22,datos!$A$4:$AD$52,7)","v":164},{"$f":"VLOOKUP($A22,datos!$A$4:$AD$52,8)","v":192},{"$f":"VLOOKUP($A22,datos!$A$4:$AD$52,9)","v":168},1086,6,181,"17°",252]
["j32",{"$f":"VLOOKUP($A23,datos!$A$4:$AD$52,2)","v":"ADRIAN GUIBU K."},{"$f":"VLOOKUP($A23,datos!$A$4:$AD$52,3)","v":"Perú"},{"$f":"VLOOKUP($A23,datos!$A$4:$AD$52,4)","v":170},{"$f":"VLOOKUP($A23,datos!$A$4:$AD$52,5)","v":142},{"$f":"VLOOKUP($A23,datos!$A$4:$AD$52,6)","v":139},{"$f":"VLOOKUP($A23,datos!$A$4:$AD$52,7)","v":166},{"$f":"VLOOKUP($A23,datos!$A$4:$AD$52,8)","v":269},{"$f":"VLOOKUP($A23,datos!$A$4:$AD$52,9)","v":193},1079,6,179.83333333333334,"18°",259]
["j12",{"$f":"VLOOKUP($A24,datos!$A$4:$AD$52,2)","v":"AGUSTIN LEANDRO A."},{"$f":"VLOOKUP($A24,datos!$A$4:$AD$52,3)","v":"Argentina"},{"$f":"VLOOKUP($A24,datos!$A$4:$AD$52,4)","v":184},{"$f":"VLOOKUP($A24,datos!$A$4:$AD$52,5)","v":165},{"$f":"VLOOKUP($A24,datos!$A$4:$AD$52,6)","v":165},{"$f":"VLOOKUP($A24,datos!$A$4:$AD$52,7)","v":203},{"$f":"VLOOKUP($A24,datos!$A$4:$AD$52,8)","v":178},{"$f":"VLOOKUP($A24,datos!$A$4:$AD$52,9)","v":172},1067,6,177.83333333333334,"19°",271]
["j14",{"$f":"VLOOKUP($A25,datos!$A$4:$AD$52,2)","v":"FABRICIO E. SANDUAY"},{"$f":"VLOOKUP($A25,datos!$A$4:$AD$52,3)","v":"Argentina"},{"$f":"VLOOKUP($A25,datos!$A$4:$AD$52,4)","v":140},{"$f":"VLOOKUP($A25,datos!$A$4:$AD$52,5)","v":150},{"$f":"VLOOKUP($A25,datos!$A$4:$AD$52,6)","v":204},{"$f":"VLOOKUP($A25,datos!$A$4:$AD$52,7)","v":211},{"$f":"VLOOKUP($A25,datos!$A$4:$AD$52,8)","v":146},{"$f":"VLOOKUP($A25,datos!$A$4:$AD$52,9)","v":194},1045,6,174.16666666666666,"20°",293]
["j34",{"$f":"VLOOKUP($A26,datos!$A$4:$AD$52,2)","v":"KEIJI M. CAJACHACAHUA M."},{"$f":"VLOOKUP($A26,datos!$A$4:$AD$52,3)","v":"Perú"},{"$f":"VLOOKUP($A26,datos!$A$4:$AD$52,4)","v":178},{"$f":"VLOOKUP($A26,datos!$A$4:$AD$52,5)","v":198},{"$f":"VLOOKUP($A26,datos!$A$4:$AD$52,6)","v":183},{"$f":"VLOOKUP($A26,datos!$A$4:$AD$52,7)","v":127},{"$f":"VLOOKUP($A26,datos!$A$4:$AD$52,8)","v":164},{"$f":"VLOOKUP($A26,datos!$A$4:$AD$52,9)","v":150},1000,6,166.66666666666666,"21°",338]
["j29",{"$f":"VLOOKUP($A27,datos!$A$4:$AD$52,2)","v":"MATIAS NAZAR G."},{"$f":"VLOOKUP($A27,datos!$A$4:$AD$52,3)","v":"Chile"},{"$f":"VLOOKUP($A27,datos!$A$4:$AD$52,4)","v":157},{"$f":"VLOOKUP($A27,datos!$A$4:$AD$52,5)","v":167},{"$f":"VLOOKUP($A27,datos!$A$4:$AD$52,6)","v":182},{"$f":"VLOOKUP($A27,datos!$A$4:$AD$52,7)","v":159},{"$f":"VLOOKUP($A27,datos!$A$4:$AD$52,8)","v":149},{"$f":"VLOOKUP($A27,datos!$A$4:$AD$52,9)","v":160},974,6,162.33333333333334,"22°",364]
["j38",{"$f":"VLOOKUP($A28,datos!$A$4:$AD$52,2)","v":"FELIPE FUENTES F."},{"$f":"VLOOKUP($A28,datos!$A$4:$AD$52,3)","v":"Uruguay"},{"$f":"VLOOKUP($A28,datos!$A$4:$AD$52,4)","v":150},{"$f":"VLOOKUP($A28,datos!$A$4:$AD$52,5)","v":125},{"$f":"VLOOKUP($A28,datos!$A$4:$AD$52,6)","v":174},{"$f":"VLOOKUP($A28,datos!$A$4:$AD$52,7)","v":191},{"$f":"VLOOKUP($A28,datos!$A$4:$AD$52,8)","v":152},{"$f":"VLOOKUP($A28,datos!$A$4:$AD$52,9)","v":140},932,6,155.33333333333334,"23°",406]
["j37",{"$f":"VLOOKUP($A29,datos!$A$4:$AD$52,2)","v":"ALFONSO RODRIGUEZ L."},{"$f":"VLOOKUP($A29,datos!$A$4:$AD$52,3)","v":"Uruguay"},{"$f":"VLOOKUP($A29,datos!$A$4:$AD$52,4)","v":163},{"$f":"VLOOKUP($A29,datos!$A$4:$AD$52,5)","v":160},{"$f":"VLOOKUP($A29,datos!$A$4:$AD$52,6)","v":107},{"$f":"VLOOKUP($A29,datos!$A$4:$AD$52,7)","v":130},{"$f":"VLOOKUP($A29,datos!$A$4:$AD$52,8)","v":180},{"$f":"VLOOKUP($A29,datos!$A$4:$AD$52,9)","v":151},891,6,148.5,"24°",447]
["j36",{"$f":"VLOOKUP($A30,datos!$A$4:$AD$52,2)","v":"MATIAS DA MOTTA L."},{"$f":"VLOOKUP($A30,datos!$A$4:$AD$52,3)","v":"Uruguay"},{"$f":"VLOOKUP($A30,datos!$A$4:$AD$52,4)","v":125},{"$f":"VLOOKUP($A30,datos!$A$4:$AD$52,5)","v":158},{"$f":"VLOOKUP($A30,datos!$A$4:$AD$52,6)","v":139},{"$f":"VLOOKUP($A30,datos!$A$4:$AD$52,7)","v":147},{"$f":"VLOOKUP($A30,datos!$A$4:$AD$52,8)","v":124},{"$f":"VLOOKUP($A30,datos!$A$4:$AD$52,9)","v":151},844,6,140.66666666666666,"25°",494]
["j30",{"$f":"VLOOKUP($A31,datos!$A$4:$AD$52,2)","v":"IVAN VELIZ H."},{"$f":"VLOOKUP($A31,datos!$A$4:$AD$52,3)","v":"Chile"},{"$f":"VLOOKUP($A31,datos!$A$4:$AD$52,4)","v":158},{"$f":"VLOOKUP($A31,datos!$A$4:$AD$52,5)","v":133},{"$f":"VLOOKUP($A31,datos!$A$4:$AD$52,6)","v":123},{"$f":"VLOOKUP($A31,datos!$A$4:$AD$52,7)","v":158},{"$f":"VLOOKUP($A31,datos!$A$4:$AD$52,8)","v":137},{"$f":"VLOOKUP($A31,datos!$A$4:$AD$52,9)","v":112},821,6,136.83333333333334,"26°",517]
["j31",{"$f":"VLOOKUP($A32,datos!$A$4:$AD$52,2)","v":"LUIS JEREZ G."},{"$f":"VLOOKUP($A32,datos!$A$4:$AD$52,3)","v":"Chile"},{"$f":"VLOOKUP($A32,datos!$A$4:$AD$52,4)","v":154},{"$f":"VLOOKUP($A32,datos!$A$4:$AD$52,5)","v":116},{"$f":"VLOOKUP($A32,datos!$A$4:$AD$52,6)","v":117},{"$f":"VLOOKUP($A32,datos!$A$4:$AD$52,7)","v":116},{"$f":"VLOOKUP($A32,datos!$A$4:$AD$52,8)","v":103},{"$f":"VLOOKUP($A32,datos!$A$4:$AD$52,9)","v":103},709,6,118.16666666666667,"27°",629]

{"sheet":"PAR","index":2,"n_rows":124,"n_cols":17,"rows_kept":124,"cut":false,"hidden":false,"merged":[[1,0,1,13],[2,0,2,13],[101,13,102,13],[61,13,62,13],[11,13,12,13],[41,13,42,13],[31,13,32,13],[3,1,3,13],[56,13,57,13],[6,13,7,13],[51,13,52,13],[76,13,77,13],[86,13,87,13],[66,13,67,13],[71,13,72,13],[81,13,82,13],[116,13,117,13],[121,13,122,13],[16,13,17,13],[91,13,92,13],[21,13,22,13],[46,13,47,13],[36,13,37,13],[26,13,27,13],[111,13,112,13],[96,13,97,13],[106,13,107,13]]}
[]
["             CAMPEONATO SUDAMERICANO JUVENIL 2014"]
["DOBLES  SUB 20"]
[]
["Cod","Nombre del Jugador","FEDERACION","L1","L2","L3","L4","L5","L6","Serie",null,{"$f":"M8","v":193.33333333333334},"Prom","dif"]
["j27",{"$f":"VLOOKUP($A6,datos!$A$4:$AD$52,2)","v":"JORGE FIGUEROA"},{"$f":"VLOOKUP($A6,datos!$A$4:$AD$52,3)","v":"Colombia"},{"$f":"VLOOKUP($A6,datos!$A$4:$AD$52,10)","v":242},{"$f":"VLOOKUP($A6,datos!$A$4:$AD$52,11)","v":148},{"$f":"VLOOKUP($A6,datos!$A$4:$AD$52,12)","v":216},{"$f":"VLOOKUP($A6,datos!$A$4:$AD$52,13)","v":212},{"$f":"VLOOKUP($A6,datos!$A$4:$AD$52,14)","v":184},{"$f":"VLOOKUP($A6,datos!$A$4:$AD$52,15)","v":175},{"$f":"SUM(D6:I6)","v":1177},{"$f":"(COUNTIF(D6:I6,\">0\"))","v":6},{"$f":"M8","v":193.33333333333334},{"$f":"J6/K6","v":196.16666666666666}]
["j25",{"$f":"VLOOKUP($A7,datos!$A$4:$AD$52,2)","v":"SEBASTIAN DONADO"},{"$f":"VLOOKUP($A7,datos!$A$4:$AD$52,3)","v":"Colombia"},{"$f":"VLOOKUP($A7,datos!$A$4:$AD$52,10)","v":173},{"$f":"VLOOKUP($A7,datos!$A$4:$AD$52,11)","v":197},{"$f":"VLOOKUP($A7,datos!$A$4:$AD$52,12)","v":200},{"$f":"VLOOKUP($A7,datos!$A$4:$AD$52,13)","v":157},{"$f":"VLOOKUP($A7,datos!$A$4:$AD$52,14)","v":214},{"$f":"VLOOKUP($A7,datos!$A$4:$AD$52,15)","v":202},{"$f":"SUM(D7:I7)","v":1143},{"$f":"(COUNTIF(D7:I7,\">0\"))","v":6},{"$f":"M8","v":193.33333333333334},{"$f":"J7/K7","v":190.5},"1°"]
[null,null,null,{"$f":"SUM(D6:D7)","v":415},345,416,369,398,377,2320,{"$f":"(COUNTIF(D8:I8,\">0\"))*2","v":12},{"$f":"M8","v":193.33333333333334},{"$f":"J8/K8","v":193.33333333333334},null,null,{"$f":"MAX(D8:I8)","v":416}]
[null,null,null,null,null,null,null,null,null,null,null,{"$f":"M8","v":193.33333333333334}]
["Cod","Nombre del Jugador","FEDERACION","L1","L2","L3","L4","L5","L6","Serie",null,{"$f":"M13","v":192.66666666666666},"Prom","dif"]
["j22",{"$f":"VLOOKUP($A11,datos!$A$4:$AD$52,2)","v":"THIAGO FELICETTI"},{"$f":"VLOOKUP($A11,datos!$A$4:$AD$52,3)","v":"Brasil"},{"$f":"VLOOKUP($A11,datos!$A$4:$AD$52,10)","v":134},{"$f":"VLOOKUP($A11,datos!$A$4:$AD$52,11)","v":214},{"$f":"VLOOKUP($A11,datos!$A$4:$AD$52,12)","v":235},{"$f":"VLOOKUP($A11,datos!$A$4:$AD$52,13)","v":173},{"$f":"VLOOKUP($A11,datos!$A$4:$AD$52,14)","v":133},{"$f":"VLOOKUP($A11,datos!$A$4:$AD$52,15)","v":173},{"$f":"SUM(D11:I11)","v":1062},{"$f":"(COUNTIF(D11:I11,\">0\"))","v":6},{"$f":"M13","v":192.66666666666666},{"$f":"J11/K11","v":177},{"$f":"$J$8-J13","v":8}]
["j20",{"$f":"VLOOKUP($A12,datos!$A$4:$AD$52,2)","v":"BRUNO COSTA S"},{"$f":"VLOOKUP($A12,datos!$A$4:$AD$52,3)","v":"Brasil"},{"$f":"VLOOKUP($A12,datos!$A$4:$AD$52,10)","v":178},{"$f":"VLOOKUP($A12,datos!$A$4:$AD$52,11)","v":200},{"$f":"VLOOKUP($A12,datos!$A$4:$AD$52,12)","v":213},{"$f":"VLOOKUP($A12,datos!$A$4:$AD$52,13)","v":210},{"$f":"VLOOKUP($A12,datos!$A$4:$AD$52,14)","v":202},{"$f":"VLOOKUP($A12,datos!$A$4:$AD$52,15)","v":247},{"$f":"SUM(D12:I12)","v":1250},{"$f":"(COUNTIF(D12:I12,\">0\"))","v":6},{"$f":"M13","v":192.66666666666666},{"$f":"J12/K12","v":208.33333333333334},"2°"]
[null,null,null,{"$f":"SUM(D11:D12)","v":312},414,448,383,335,420,2312,{"$f":"(COUNTIF(D13:I13,\">0\"))*2","v":12},{"$f":"M13","v":192.66666666666666},{"$f":"J13/K13","v":192.66666666666666},null,null,{"$f":"MAX(D13:I13)","v":448}]
[null,null,null,null,null,null,null,null,null,null,null,{"$f":"M13","v":192.66666666666666}]
["Cod","Nombre del Jugador","FEDERACION","L1","L2","L3","L4","L5","L6","Serie",null,{"$f":"M18","v":183.5},"Prom","dif"]
["j33",{"$f":"VLOOKUP($A16,datos!$A$4:$AD$52,2)","v":"JUAN ANDRES YUZURIHA"},{"$f":"VLOOKUP($A16,datos!$A$4:$AD$52,3)","v":"Perú"},{"$f":"VLOOKUP($A16,datos!$A$4:$AD$52,10)","v":213},{"$f":"VLOOKUP($A16,datos!$A$4:$AD$52,11)","v":183},{"$f":"VLOOKUP($A16,datos!$A$4:$AD$52,12)","v":159},{"$f":"VLOOKUP($A16,datos!$A$4:$AD$52,13)","v":183},{"$f":"VLOOKUP($A16,datos!$A$4:$AD$52,14)","v":207},{"$f":"VLOOKUP($A16,datos!$A$4:$AD$52,15)","v":205},{"$f":"SUM(D16:I16)","v":1150},{"$f":"(COUNTIF(D16:I16,\">0\"))","v":6},{"$f":"M18","v":183.5},{"$f":"J16/K16","v":191.66666666666666},{"$f":"$J$8-J18","v":118}]
["j35",{"$f":"VLOOKUP($A17,datos!$A$4:$AD$52,2)","v":"RENZO GUIBU K."},{"$f":"VLOOKUP($A17,datos!$A$4:$AD$52,3)","v":"Perú"},{"$f":"VLOOKUP($A17,datos!$A$4:$AD$52,10)","v":154},{"$f":"VLOOKUP($A17,datos!$A$4:$AD$52,11)","v":181},{"$f":"VLOOKUP($A17,datos!$A$4:$AD$52,12)","v":145},{"$f":"VLOOKUP($A17,datos!$A$4:$AD$52,13)","v":199},{"$f":"VLOOKUP($A17,datos!$A$4:$AD$52,14)","v":184},{"$f":"VLOOKUP($A17,datos!$A$4:$AD$52,15)","v":189},{"$f":"SUM(D17:I17)","v":1052},{"$f":"(COUNTIF(D17:I17,\">0\"))","v":6},{"$f":"M18","v":183.5},{"$f":"J17/K17","v":175.33333333333334},"3°"]
[null,null,null,{"$f":"SUM(D16:D17)","v":367},364,304,382,391,394,2202,{"$f":"(COUNTIF(D18:I18,\">0\"))*2","v":12},{"$f":"M18","v":183.5},{"$f":"J18/K18","v":183.5},null,null,{"$f":"MAX(D23:I23)","v":399}]
[null,null,null,null,null,null,null,null,null,null,null,{"$f":"M18","v":183.5}]
["Cod","Nombre del Jugador","FEDERACION","L1","L2","L3","L4","L5","L6","Serie",null,{"$f":"M23","v":179.91666666666666},"Prom","dif"]
["j26",{"$f":"VLOOKUP($A21,datos!$A$4:$AD$52,2)","v":"SEBASTIAN CHARRY"},{"$f":"VLOOKUP($A21,datos!$A$4:$AD$52,3)","v":"Colombia"},{"$f":"VLOOKUP($A21,datos!$A$4:$AD$52,10)","v":225},{"$f":"VLOOKUP($A21,datos!$A$4:$AD$52,11)","v":199},{"$f":"VLOOKUP($A21,datos!$A$4:$AD$52,12)","v":174},{"$f":"VLOOKUP($A21,datos!$A$4:$AD$52,13)","v":169},{"$f":"VLOOKUP($A21,datos!$A$4:$AD$52,14)","v":191},{"$f":"VLOOKUP($A21,datos!$A$4:$AD$52,15)","v":195},{"$f":"SUM(D21:I21)","v":1153},{"$f":"(COUNTIF(D21:I21,\">0\"))","v":6},{"$f":"M23","v":179.91666666666666},{"$f":"J21/K21","v":192.16666666666666},{"$f":"$J$8-J23","v":161}]
["j24",{"$f":"VLOOKUP($A22,datos!$A$4:$AD$52,2)","v":"CARLOS F. SAAVEDRA"},{"$f":"VLOOKUP($A22,datos!$A$4:$AD$52,3)","v":"Colombia"},{"$f":"VLOOKUP($A22,datos!$A$4:$AD$52,10)","v":154},{"$f":"VLOOKUP($A22,datos!$A$4:$AD$52,11)","v":175},{"$f":"VLOOKUP($A22,datos!$A$4:$AD$52,12)","v":164},{"$f":"VLOOKUP($A22,datos!$A$4:$AD$52,13)","v":160},{"$f":"VLOOKUP($A22,datos!$A$4:$AD$52,14)","v":149},{"$f":"VLOOKUP($A22,datos!$A$4:$AD$52,15)","v":204},{"$f":"SUM(D22:I22)","v":1006},{"$f":"(COUNTIF(D22:I22,\">0\"))","v":6},{"$f":"M23","v":179.91666666666666},{"$f":"J22/K22","v":167.66666666666666},"4°"]
[null,null,null,{"$f":"SUM(D21:D22)","v":379},374,338,329,340,399,2159,{"$f":"(COUNTIF(D23:I23,\">0\"))*2","v":12},{"$f":"M23","v":179.91666666666666},{"$f":"J23/K23","v":179.91666666666666},null,null,{"$f":"MAX(D28:I28)","v":385}]
[null,null,null,null,null,null,null,null,null,null,null,{"$f":"M23","v":179.91666666666666}]
["Cod","Nombre del Jugador","FEDERACION","L1","L2","L3","L4","L5","L6","Serie",null,{"$f":"M28","v":178.5},"Prom","dif"]
["j13",{"$f":"VLOOKUP($A26,datos!$A$4:$AD$52,2)","v":"FRANCO R. GUALINI"},{"$f":"VLOOKUP($A26,datos!$A$4:$AD$52,3)","v":"Argentina"},{"$f":"VLOOKUP($A26,datos!$A$4:$AD$52,10)","v":168},{"$f":"VLOOKUP($A26,datos!$A$4:$AD$52,11)","v":172},{"$f":"VLOOKUP($A26,datos!$A$4:$AD$52,12)","v":180},{"$f":"VLOOKUP($A26,datos!$A$4:$AD$52,13)","v":188},{"$f":"VLOOKUP($A26,datos!$A$4:$AD$52,14)","v":182},{"$f":"VLOOKUP($A26,datos!$A$4:$AD$52,15)","v":198},{"$f":"SUM(D26:I26)","v":1088},{"$f":"(COUNTIF(D26:I26,\">0\"))","v":6},{"$f":"M28","v":178.5},{"$f":"J26/K26","v":181.33333333333334},{"$f":"$J$8-J28","v":178}]
["j15",{"$f":"VLOOKUP($A27,datos!$A$4:$AD$52,2)","v":"FERNANDO TAPIA M."},{"$f":"VLOOKUP($A27,datos!$A$4:$AD$52,3)","v":"Argentina"},{"$f":"VLOOKUP($A27,datos!$A$4:$AD$52,10)","v":205},{"$f":"VLOOKUP($A27,datos!$A$4:$AD$52,11)","v":180},{"$f":"VLOOKUP($A27,datos!$A$4:$AD$52,12)","v":149},{"$f":"VLOOKUP($A27,datos!$A$4:$AD$52,13)","v":157},{"$f":"VLOOKUP($A27,datos!$A$4:$AD$52,14)","v":176},{"$f":"VLOOKUP($A27,datos!$A$4:$AD$52,15)","v":187},{"$f":"SUM(D27:I27)","v":1054},{"$f":"(COUNTIF(D27:I27,\">0\"))","v":6},{"$f":"M28","v":178.5},{"$f":"J27/K27","v":175.66666666666666},"5°"]
[null,null,null,{"$f":"SUM(D26:D27)","v":373},352,329,345,358,385,2142,{"$f":"(COUNTIF(D28:I28,\">0\"))*2","v":12},{"$f":"M28","v":178.5},{"$f":"J28/K28","v":178.5},null,null,{"$f":"MAX(D38:I38)","v":394}]
[null,null,null,null,null,null,null,null,null,null,null,{"$f":"M28","v":178.5}]
["Cod","Nombre del Jugador","FEDERACION","L1","L2","L3","L4","L5","L6","Serie",null,{"$f":"M33","v":174.33333333333334},"Prom","dif"]
["j17",{"$f":"VLOOKUP($A31,datos!$A$4:$AD$52,2)","v":"YANNICK ROOS"},{"$f":"VLOOKUP($A31,datos!$A$4:$AD$52,3)","v":"Aruba"},{"$f":"VLOOKUP($A31,datos!$A$4:$AD$52,10)","v":187},{"$f":"VLOOKUP($A31,datos!$A$4:$AD$52,11)","v":147},{"$f":"VLOOKUP($A31,datos!$A$4:$AD$52,12)","v":135},{"$f":"VLOOKUP($A31,datos!$A$4:$AD$52,13)","v":143},{"$f":"VLOOKUP($A31,datos!$A$4:$AD$52,14)","v":161},{"$f":"VLOOKUP($A31,datos!$A$4:$AD$52,15)","v":158},{"$f":"SUM(D31:I31)","v":931},{"$f":"(COUNTIF(D31:I31,\">0\"))","v":6},{"$f":"M33","v":174.33333333333334},{"$f":"J31/K31","v":155.16666666666666},{"$f":"$J$8-J33","v":228}]
["j16",{"$f":"VLOOKUP($A32,datos!$A$4:$AD$52,2)","v":"BRIAN HELMEYER"},{"$f":"VLOOKUP($A32,datos!$A$4:$AD$52,3)","v":"Aruba"},{"$f":"VLOOKUP($A32,datos!$A$4:$AD$52,10)","v":177},{"$f":"VLOOKUP($A32,datos!$A$4:$AD$52,11)","v":172},{"$f":"VLOOKUP($A32,datos!$A$4:$AD$52,12)","v":193},{"$f":"VLOOKUP($A32,datos!$A$4:$AD$52,13)","v":200},{"$f":"VLOOKUP($A32,datos!$A$4:$AD$52,14)","v":235},{"$f":"VLOOKUP($A32,datos!$A$4:$AD$52,15)","v":184},{"$f":"SUM(D32:I32)","v":1161},{"$f":"(COUNTIF(D32:I32,\">0\"))","v":6},{"$f":"M33","v":174.33333333333334},{"$f":"J32/K32","v":193.5},"6°"]
[null,null,null,{"$f":"SUM(D31:D32)","v":364},319,328,343,396,342,2092,{"$f":"(COUNTIF(D33:I33,\">0\"))*2","v":12},{"$f":"M33","v":174.33333333333334},{"$f":"J33/K33","v":174.33333333333334},null,null,{"$f":"MAX(D43:I43)","v":407}]
[null,null,null,null,null,null,null,null,null,null,null,{"$f":"M33","v":174.33333333333334}]
["Cod","Nombre del Jugador","FEDERACION","L1","L2","L3","L4","L5","L6","Serie",null,{"$f":"M38","v":172.5},"Prom","dif"]
["j23",{"$f":"VLOOKUP($A36,datos!$A$4:$AD$52,2)","v":"JOAO I. FERREIRA N. "},{"$f":"VLOOKUP($A36,datos!$A$4:$AD$52,3)","v":"Brasil"},{"$f":"VLOOKUP($A36,datos!$A$4:$AD$52,10)","v":157},{"$f":"VLOOKUP($A36,datos!$A$4:$AD$52,11)","v":173},{"$f":"VLOOKUP($A36,datos!$A$4:$AD$52,12)","v":200},{"$f":"VLOOKUP($A36,datos!$A$4:$AD$52,13)","v":192},{"$f":"VLOOKUP($A36,datos!$A$4:$AD$52,14)","v":156},{"$f":"VLOOKUP($A36,datos!$A$4:$AD$52,15)","v":203},{"$f":"SUM(D36:I36)","v":1081},{"$f":"(COUNTIF(D36:I36,\">0\"))","v":6},{"$f":"M38","v":172.5},{"$f":"J36/K36","v":180.16666666666666},{"$f":"$J$8-J38","v":250}]
["j21",{"$f":"VLOOKUP($A37,datos!$A$4:$AD$52,2)","v":"BERNARDO ABREU"},{"$f":"VLOOKUP($A37,datos!$A$4:$AD$52,3)","v":"Brasil"},{"$f":"VLOOKUP($A37,datos!$A$4:$AD$52,10)","v":176},{"$f":"VLOOKUP($A37,datos!$A$4:$AD$52,11)","v":154},{"$f":"VLOOKUP($A37,datos!$A$4:$AD$52,12)","v":194},{"$f":"VLOOKUP($A37,datos!$A$4:$AD$52,13)","v":131},{"$f":"VLOOKUP($A37,datos!$A$4:$AD$52,14)","v":169},{"$f":"VLOOKUP($A37,datos!$A$4:$AD$52,15)","v":165},{"$f":"SUM(D37:I37)","v":989},{"$f":"(COUNTIF(D37:I37,\">0\"))","v":6},{"$f":"M38","v":172.5},{"$f":"J37/K37","v":164.83333333333334},"7°"]
[null,null,null,{"$f":"SUM(D36:D37)","v":333},327,394,323,325,368,2070,{"$f":"(COUNTIF(D38:I38,\">0\"))*2","v":12},{"$f":"M38","v":172.5},{"$f":"J38/K38","v":172.5},null,null,{"$f":"MAX(D98:I98)","v":{"$error":"#N/A"}}]
[null,null,null,null,null,null,null,null,null,null,null,{"$f":"M38","v":172.5}]
["Cod","Nombre del Jugador","FEDERACION","L1","L2","L3","L4","L5","L6","Serie",null,{"$f":"M43","v":172.08333333333334},"Prom","dif"]
["j18",{"$f":"VLOOKUP($A41,datos!$A$4:$AD$52,2)","v":"OSMAR BISLIP"},{"$f":"VLOOKUP($A41,datos!$A$4:$AD$52,3)","v":"Aruba"},{"$f":"VLOOKUP($A41,datos!$A$4:$AD$52,10)","v":205},{"$f":"VLOOKUP($A41,datos!$A$4:$AD$52,11)","v":159},{"$f":"VLOOKUP($A41,datos!$A$4:$AD$52,12)","v":158},{"$f":"VLOOKUP($A41,datos!$A$4:$AD$52,13)","v":200},{"$f":"VLOOKUP($A41,datos!$A$4:$AD$52,14)","v":145},{"$f":"VLOOKUP($A41,datos!$A$4:$AD$52,15)","v":175},{"$f":"SUM(D41:I41)","v":1042},{"$f":"(COUNTIF(D41:I41,\">0\"))","v":6},{"$f":"M43","v":172.08333333333334},{"$f":"J41/K41","v":173.66666666666666},{"$f":"$J$8-J43","v":255}]
["j19",{"$f":"VLOOKUP($A42,datos!$A$4:$AD$52,2)","v":"ELIAS HALABI"},{"$f":"VLOOKUP($A42,datos!$A$4:$AD$52,3)","v":"Aruba"},{"$f":"VLOOKUP($A42,datos!$A$4:$AD$52,10)","v":202},{"$f":"VLOOKUP($A42,datos!$A$4:$AD$52,11)","v":154},{"$f":"VLOOKUP($A42,datos!$A$4:$AD$52,12)","v":173},{"$f":"VLOOKUP($A42,datos!$A$4:$AD$52,13)","v":186},{"$f":"VLOOKUP($A42,datos!$A$4:$AD$52,14)","v":182},{"$f":"VLOOKUP($A42,datos!$A$4:$AD$52,15)","v":126},{"$f":"SUM(D42:I42)","v":1023},{"$f":"(COUNTIF(D42:I42,\">0\"))","v":6},{"$f":"M43","v":172.08333333333334},{"$f":"J42/K42","v":170.5},"8°"]
[null,null,null,{"$f":"SUM(D41:D42)","v":407},313,331,386,327,301,2065,{"$f":"(COUNTIF(D43:I43,\">0\"))*2","v":12},{"$f":"M43","v":172.08333333333334},{"$f":"J43/K43","v":172.08333333333334},null,null,{"$f":"MAX(D18:I18)","v":394}]
[null,null,null,null,null,null,null,null,null,null,null,{"$f":"M43","v":172.08333333333334}]
["Cod","Nombre del Jugador","FEDERACION","L1","L2","L3","L4","L5","L6","Serie",null,{"$f":"M48","v":171.75},"Prom","dif"]
["j12",{"$f":"VLOOKUP($A46,datos!$A$4:$AD$52,2)","v":"AGUSTIN LEANDRO A."},{"$f":"VLOOKUP($A46,datos!$A$4:$AD$52,3)","v":"Argentina"},{"$f":"VLOOKUP($A46,datos!$A$4:$AD$52,10)","v":147},{"$f":"VLOOKUP($A46,datos!$A$4:$AD$52,11)","v":210},{"$f":"VLOOKUP($A46,datos!$A$4:$AD$52,12)","v":171},{"$f":"VLOOKUP($A46,datos!$A$4:$AD$52,13)","v":219},{"$f":"VLOOKUP($A46,datos!$A$4:$AD$52,14)","v":157},{"$f":"VLOOKUP($A46,datos!$A$4:$AD$52,15)","v":188},{"$f":"SUM(D46:I46)","v":1092},{"$f":"(COUNTIF(D46:I46,\">0\"))","v":6},{"$f":"M48","v":171.75},{"$f":"J46/K46","v":182},{"$f":"$J$8-J48","v":259}]
["j14",{"$f":"VLOOKUP($A47,datos!$A$4:$AD$52,2)","v":"FABRICIO E. SANDUAY"},{"$f":"VLOOKUP($A47,datos!$A$4:$AD$52,3)","v":"Argentina"},{"$f":"VLOOKUP($A47,datos!$A$4:$AD$52,10)","v":170},{"$f":"VLOOKUP($A47,datos!$A$4:$AD$52,11)","v":171},{"$f":"VLOOKUP($A47,datos!$A$4:$AD$52,12)","v":157},{"$f":"VLOOKUP($A47,datos!$A$4:$AD$52,13)","v":168},{"$f":"VLOOKUP($A47,datos!$A$4:$AD$52,14)","v":178},{"$f":"VLOOKUP($A47,datos!$A$4:$AD$52,15)","v":125},{"$f":"SUM(D47:I47)","v":969},{"$f":"(COUNTIF(D47:I47,\">0\"))","v":6},{"$f":"M48","v":171.75},{"$f":"J47/K47","v":161.5},"9°"]
[null,null,null,{"$f":"SUM(D46:D47)","v":317},381,328,387,335,313,2061,{"$f":"(COUNTIF(D48:I48,\">0\"))*2","v":12},{"$f":"M48","v":171.75},{"$f":"J48/K48","v":171.75},null,null,{"$f":"MAX(D73:I73)","v":{"$error":"#N/A"}}]
[null,null,null,null,null,null,null,null,null,null,null,{"$f":"M48","v":171.75}]
["Cod","Nombre del Jugador","FEDERACION","L1","L2","L3","L4","L5","L6","Serie",null,{"$f":"M53","v":169.83333333333334},"Prom","dif"]
["j28",{"$f":"VLOOKUP($A51,datos!$A$4:$AD$52,2)","v":"BASTIAN MALDONADO R."},{"$f":"VLOOKUP($A51,datos!$A$4:$AD$52,3)","v":"Chile"},{"$f":"VLOOKUP($A51,datos!$A$4:$AD$52,10)","v":201},{"$f":"VLOOKUP($A51,datos!$A$4:$AD$52,11)","v":148},{"$f":"VLOOKUP($A51,datos!$A$4:$AD$52,12)","v":130},{"$f":"VLOOKUP($A51,datos!$A$4:$AD$52,13)","v":165},{"$f":"VLOOKUP($A51,datos!$A$4:$AD$52,14)","v":165},{"$f":"VLOOKUP($A51,datos!$A$4:$AD$52,15)","v":152},{"$f":"SUM(D51:I51)","v":961},{"$f":"(COUNTIF(D51:I51,\">0\"))","v":6},{"$f":"M53","v":169.83333333333334},{"$f":"J51/K51","v":160.16666666666666},{"$f":"$J$8-J53","v":282}]
["j29",{"$f":"VLOOKUP($A52,datos!$A$4:$AD$52,2)","v":"MATIAS NAZAR G."},{"$f":"VLOOKUP($A52,datos!$A$4:$AD$52,3)","v":"Chile"},{"$f":"VLOOKUP($A52,datos!$A$4:$AD$52,10)","v":141},{"$f":"VLOOKUP($A52,datos!$A$4:$AD$52,11)","v":212},{"$f":"VLOOKUP($A52,datos!$A$4:$AD$52,12)","v":189},{"$f":"VLOOKUP($A52,datos!$A$4:$AD$52,13)","v":195},{"$f":"VLOOKUP($A52,datos!$A$4:$AD$52,14)","v":175},{"$f":"VLOOKUP($A52,datos!$A$4:$AD$52,15)","v":165},{"$f":"SUM(D52:I52)","v":1077},{"$f":"(COUNTIF(D52:I52,\">0\"))","v":6},{"$f":"M53","v":169.83333333333334},{"$f":"J52/K52","v":179.5},"10°"]
[null,null,null,{"$f":"SUM(D51:D52)","v":342},360,319,360,340,317,2038,{"$f":"(COUNTIF(D53:I53,\">0\"))*2","v":12},{"$f":"M53","v":169.83333333333334},{"$f":"J53/K53","v":169.83333333333334},null,null,{"$f":"MAX(D33:I33)","v":396}]
[null,null,null,null,null,null,null,null,null,null,null,{"$f":"M53","v":169.83333333333334}]
["Cod","Nombre del Jugador","FEDERACION","L1","L2","L3","L4","L5","L6","Serie",null,{"$f":"M58","v":166.5},"Prom","dif"]
["j34",{"$f":"VLOOKUP($A56,datos!$A$4:$AD$52,2)","v":"KEIJI M. CAJACHACAHUA M."},{"$f":"VLOOKUP($A56,datos!$A$4:$AD$52,3)","v":"Perú"},{"$f":"VLOOKUP($A56,datos!$A$4:$AD$52,10)","v":176},{"$f":"VLOOKUP($A56,datos!$A$4:$AD$52,11)","v":155},{"$f":"VLOOKUP($A56,datos!$A$4:$AD$52,12)","v":147},{"$f":"VLOOKUP($A56,datos!$A$4:$AD$52,13)","v":140},{"$f":"VLOOKUP($A56,datos!$A$4:$AD$52,14)","v":170},{"$f":"VLOOKUP($A56,datos!$A$4:$AD$52,15)","v":206},{"$f":"SUM(D56:I56)","v":994},{"$f":"(COUNTIF(D56:I56,\">0\"))","v":6},{"$f":"M58","v":166.5},{"$f":"J56/K56","v":165.66666666666666},{"$f":"$J$8-J58","v":322}]
["j32",{"$f":"VLOOKUP($A57,datos!$A$4:$AD$52,2)","v":"ADRIAN GUIBU K."},{"$f":"VLOOKUP($A57,datos!$A$4:$AD$52,3)","v":"Perú"},{"$f":"VLOOKUP($A57,datos!$A$4:$AD$52,10)","v":133},{"$f":"VLOOKUP($A57,datos!$A$4:$AD$52,11)","v":146},{"$f":"VLOOKUP($A57,datos!$A$4:$AD$52,12)","v":224},{"$f":"VLOOKUP($A57,datos!$A$4:$AD$52,13)","v":161},{"$f":"VLOOKUP($A57,datos!$A$4:$AD$52,14)","v":149},{"$f":"VLOOKUP($A57,datos!$A$4:$AD$52,15)","v":191},{"$f":"SUM(D57:I57)","v":1004},{"$f":"(COUNTIF(D57:I57,\">0\"))","v":6},{"$f":"M58","v":166.5},{"$f":"J57/K57","v":167.33333333333334},"11°"]
[null,null,null,{"$f":"SUM(D56:D57)","v":309},301,371,301,319,397,1998,{"$f":"(COUNTIF(D58:I58,\">0\"))*2","v":12},{"$f":"M58","v":166.5},{"$f":"J58/K58","v":166.5},null,null,{"$f":"MAX(D78:I78)","v":{"$error":"#N/A"}}]
[null,null,null,null,null,null,null,null,null,null,null,{"$f":"M58","v":166.5}]
["Cod","Nombre del Jugador","FEDERACION","L1","L2","L3","L4","L5","L6","Serie",null,{"$f":"M63","v":142.66666666666666},"Prom","dif"]
["j31",{"$f":"VLOOKUP($A61,datos!$A$4:$AD$52,2)","v":"LUIS JEREZ G."},{"$f":"VLOOKUP($A61,datos!$A$4:$AD$52,3)","v":"Chile"},{"$f":"VLOOKUP($A61,datos!$A$4:$AD$52,10)","v":155},{"$f":"VLOOKUP($A61,datos!$A$4:$AD$52,11)","v":159},{"$f":"VLOOKUP($A61,datos!$A$4:$AD$52,12)","v":116},{"$f":"VLOOKUP($A61,datos!$A$4:$AD$52,13)","v":128},{"$f":"VLOOKUP($A61,datos!$A$4:$AD$52,14)","v":103},{"$f":"VLOOKUP($A61,datos!$A$4:$AD$52,15)","v":144},{"$f":"SUM(D61:I61)","v":805},{"$f":"(COUNTIF(D61:I61,\">0\"))","v":6},{"$f":"M63","v":142.66666666666666},{"$f":"J61/K61","v":134.16666666666666},{"$f":"$J$8-J63","v":608}]
["j30",{"$f":"VLOOKUP($A62,datos!$A$4:$AD$52,2)","v":"IVAN VELIZ H."},{"$f":"VLOOKUP($A62,datos!$A$4:$AD$52,3)","v":"Chile"},{"$f":"VLOOKUP($A62,datos!$A$4:$AD$52,10)","v":154},{"$f":"VLOOKUP($A62,datos!$A$4:$AD$52,11)","v":144},{"$f":"VLOOKUP($A62,datos!$A$4:$AD$52,12)","v":168},{"$f":"VLOOKUP($A62,datos!$A$4:$AD$52,13)","v":169},{"$f":"VLOOKUP($A62,datos!$A$4:$AD$52,14)","v":158},{"$f":"VLOOKUP($A62,datos!$A$4:$AD$52,15)","v":114},{"$f":"SUM(D62:I62)","v":907},{"$f":"(COUNTIF(D62:I62,\">0\"))","v":6},{"$f":"M63","v":142.66666666666666},{"$f":"J62/K62","v":151.16666666666666},"12°"]
[null,null,null,{"$f":"SUM(D61:D62)","v":309},303,284,297,261,258,1712,{"$f":"(COUNTIF(D63:I63,\">0\"))*2","v":12},{"$f":"M63","v":142.66666666666666},{"$f":"J63/K63","v":142.66666666666666},null,null,{"$f":"MAX(D113:I113)","v":{"$error":"#N/A"}}]
[null,null,null,null,null,null,null,null,null,null,null,{"$f":"M63","v":142.66666666666666}]
["Cod","Nombre del Jugador","FEDERACION","L1","L2","L3","L4","L5","L6","Serie",null,{"$f":"M68","v":139.83333333333334},"Prom","dif"]
["j37",{"$f":"VLOOKUP($A66,datos!$A$4:$AD$52,2)","v":"ALFONSO RODRIGUEZ L."},{"$f":"VLOOKUP($A66,datos!$A$4:$AD$52,3)","v":"Uruguay"},{"$f":"VLOOKUP($A66,datos!$A$4:$AD$52,10)","v":154},{"$f":"VLOOKUP($A66,datos!$A$4:$AD$52,11)","v":158},{"$f":"VLOOKUP($A66,datos!$A$4:$AD$52,12)","v":148},{"$f":"VLOOKUP($A66,datos!$A$4:$AD$52,13)","v":128},{"$f":"VLOOKUP($A66,datos!$A$4:$AD$52,14)","v":142},{"$f":"VLOOKUP($A66,datos!$A$4:$AD$52,15)","v":132},{"$f":"SUM(D66:I66)","v":862},{"$f":"(COUNTIF(D66:I66,\">0\"))","v":6},{"$f":"M68","v":139.83333333333334},{"$f":"J66/K66","v":143.66666666666666},{"$f":"$J$8-J68","v":642}]
["j38",{"$f":"VLOOKUP($A67,datos!$A$4:$AD$52,2)","v":"FELIPE FUENTES F."},{"$f":"VLOOKUP($A67,datos!$A$4:$AD$52,3)","v":"Uruguay"},{"$f":"VLOOKUP($A67,datos!$A$4:$AD$52,10)","v":123},{"$f":"VLOOKUP($A67,datos!$A$4:$AD$52,11)","v":146},{"$f":"VLOOKUP($A67,datos!$A$4:$AD$52,12)","v":138},{"$f":"VLOOKUP($A67,datos!$A$4:$AD$52,13)","v":130},{"$f":"VLOOKUP($A67,datos!$A$4:$AD$52,14)","v":154},{"$f":"VLOOKUP($A67,datos!$A$4:$AD$52,15)","v":125},{"$f":"SUM(D67:I67)","v":816},{"$f":"(COUNTIF(D67:I67,\">0\"))","v":6},{"$f":"M68","v":139.83333333333334},{"$f":"J67/K67","v":136},"13°"]
[null,null,null,{"$f":"SUM(D66:D67)","v":277},304,286,258,296,257,1678,{"$f":"(COUNTIF(D68:I68,\">0\"))*2","v":12},{"$f":"M68","v":139.83333333333334},{"$f":"J68/K68","v":139.83333333333334},null,null,{"$f":"MAX(D83:I83)","v":{"$error":"#N/A"}}]
[null,null,null,null,null,null,null,null,null,null,null,{"$f":"M68","v":139.83333333333334}]
["Cod","Nombre del Jugador","FEDERACION","L1","L2","L3","L4","L5","L6","Serie",null,{"$f":"M73","v":{"$error":"#N/A"}},"Prom"]
["j36",{"$f":"VLOOKUP($A71,datos!$A$4:$AD$52,2)","v":"MATIAS DA MOTTA L."},{"$f":"VLOOKUP($A71,datos!$A$4:$AD$52,3)","v":"Uruguay"},{"$f":"VLOOKUP($A71,datos!$A$4:$AD$52,10)","v":134},{"$f":"VLOOKUP($A71,datos!$A$4:$AD$52,11)","v":200},{"$f":"VLOOKUP($A71,datos!$A$4:$AD$52,12)","v":148},{"$f":"VLOOKUP($A71,datos!$A$4:$AD$52,13)","v":138},{"$f":"VLOOKUP($A71,datos!$A$4:$AD$52,14)","v":189},{"$f":"VLOOKUP($A71,datos!$A$4:$AD$52,15)","v":186},{"$f":"SUM(D71:I71)","v":995},{"$f":"(COUNTIF(D71:I71,\">0\"))","v":6},{"$f":"M73","v":{"$error":"#N/A"}},{"$f":"J71/K71","v":165.83333333333334}]
["C13",{"$f":"VLOOKUP($A72,datos!$A$4:$AD$52,2)","v":{"$error":"#N/A"}},{"$f":"VLOOKUP($A72,datos!$A$4:$AD$52,3)","v":{"$error":"#N/A"}},{"$f":"VLOOKUP($A72,datos!$A$4:$AD$52,10)","v":{"$error":"#N/A"}},{"$f":"VLOOKUP($A72,datos!$A$4:$AD$52,11)","v":{"$error":"#N/A"}},{"$f":"VLOOKUP($A72,datos!$A$4:$AD$52,12)","v":{"$error":"#N/A"}},{"$f":"VLOOKUP($A72,datos!$A$4:$AD$52,13)","v":{"$error":"#N/A"}},{"$f":"VLOOKUP($A72,datos!$A$4:$AD$52,14)","v":{"$error":"#N/A"}},{"$f":"VLOOKUP($A72,datos!$A$4:$AD$52,15)","v":{"$error":"#N/A"}},{"$f":"SUM(D72:I72)","v":{"$error":"#N/A"}},{"$f":"(COUNTIF(D72:I72,\">0\"))","v":0},{"$f":"M73","v":{"$error":"#N/A"}},{"$f":"J72/K72","v":{"$error":"#N/A"}},"14°"]
[null,null,null,{"$f":"SUM(D71:D72)","v":{"$error":"#N/A"}},{"$error":"#N/A"},{"$error":"#N/A"},{"$error":"#N/A"},{"$error":"#N/A"},{"$error":"#N/A"},{"$error":"#N/A"},{"$f":"(COUNTIF(D73:I73,\">0\"))*2","v":0},{"$f":"M73","v":{"$error":"#N/A"}},{"$f":"J73/K73","v":{"$error":"#N/A"}},null,null,{"$f":"MAX(D68:I68)","v":304}]
[null,null,null,null,null,null,null,null,null,null,null,{"$f":"M73","v":{"$error":"#N/A"}}]
["Cod","Nombre del Jugador","FEDERACION","L1","L2","L3","L4","L5","L6","Serie",null,{"$f":"M78","v":{"$error":"#N/A"}},"Prom","dif"]
["C11",{"$f":"VLOOKUP($A76,datos!$A$4:$AD$52,2)","v":{"$error":"#N/A"}},{"$f":"VLOOKUP($A76,datos!$A$4:$AD$52,3)","v":{"$error":"#N/A"}},{"$f":"VLOOKUP($A76,datos!$A$4:$AD$52,10)","v":{"$error":"#N/A"}},{"$f":"VLOOKUP($A76,datos!$A$4:$AD$52,11)","v":{"$error":"#N/A"}},{"$f":"VLOOKUP($A76,datos!$A$4:$AD$52,12)","v":{"$error":"#N/A"}},{"$f":"VLOOKUP($A76,datos!$A$4:$AD$52,13)","v":{"$error":"#N/A"}},{"$f":"VLOOKUP($A76,datos!$A$4:$AD$52,14)","v":{"$error":"#N/A"}},{"$f":"VLOOKUP($A76,datos!$A$4:$AD$52,15)","v":{"$error":"#N/A"}},{"$f":"SUM(D76:I76)","v":{"$error":"#N/A"}},{"$f":"(COUNTIF(D76:I76,\">0\"))","v":0},{"$f":"M78","v":{"$error":"#N/A"}},{"$f":"J76/K76","v":{"$error":"#N/A"}},{"$f":"$J$8-J78","v":{"$error":"#N/A"}}]
["C07",{"$f":"VLOOKUP($A77,datos!$A$4:$AD$52,2)","v":{"$error":"#N/A"}},{"$f":"VLOOKUP($A77,datos!$A$4:$AD$52,3)","v":{"$error":"#N/A"}},{"$f":"VLOOKUP($A77,datos!$A$4:$AD$52,10)","v":{"$error":"#N/A"}},{"$f":"VLOOKUP($A77,datos!$A$4:$AD$52,11)","v":{"$error":"#N/A"}},{"$f":"VLOOKUP($A77,datos!$A$4:$AD$52,12)","v":{"$error":"#N/A"}},{"$f":"VLOOKUP($A77,datos!$A$4:$AD$52,13)","v":{"$error":"#N/A"}},{"$f":"VLOOKUP($A77,datos!$A$4:$AD$52,14)","v":{"$error":"#N/A"}},{"$f":"VLOOKUP($A77,datos!$A$4:$AD$52,15)","v":{"$error":"#N/A"}},{"$f":"SUM(D77:I77)","v":{"$error":"#N/A"}},{"$f":"(COUNTIF(D77:I77,\">0\"))","v":0},{"$f":"M78","v":{"$error":"#N/A"}},{"$f":"J77/K77","v":{"$error":"#N/A"}},"15°"]
[null,null,null,{"$f":"SUM(D76:D77)","v":{"$error":"#N/A"}},{"$error":"#N/A"},{"$error":"#N/A"},{"$error":"#N/A"},{"$error":"#N/A"},{"$error":"#N/A"},{"$error":"#N/A"},{"$f":"(COUNTIF(D78:I78,\">0\"))*2","v":0},{"$f":"M78","v":{"$error":"#N/A"}},{"$f":"J78/K78","v":{"$error":"#N/A"}},null,null,{"$f":"MAX(D58:I58)","v":397}]
[null,null,null,null,null,null,null,null,null,null,null,{"$f":"M78","v":{"$error":"#N/A"}}]
["Cod","Nombre del Jugador","FEDERACION","L1","L2","L3","L4","L5","L6","Serie",null,{"$f":"M83","v":{"$error":"#N/A"}},"Prom","dif"]
["C15",{"$f":"VLOOKUP($A81,datos!$A$4:$AD$52,2)","v":{"$error":"#N/A"}},{"$f":"VLOOKUP($A81,datos!$A$4:$AD$52,3)","v":{"$error":"#N/A"}},{"$f":"VLOOKUP($A81,datos!$A$4:$AD$52,10)","v":{"$error":"#N/A"}},{"$f":"VLOOKUP($A81,datos!$A$4:$AD$52,11)","v":{"$error":"#N/A"}},{"$f":"VLOOKUP($A81,datos!$A$4:$AD$52,12)","v":{"$error":"#N/A"}},{"$f":"VLOOKUP($A81,datos!$A$4:$AD$52,13)","v":{"$error":"#N/A"}},{"$f":"VLOOKUP($A81,datos!$A$4:$AD$52,14)","v":{"$error":"#N/A"}},{"$f":"VLOOKUP($A81,datos!$A$4:$AD$52,15)","v":{"$error":"#N/A"}},{"$f":"SUM(D81:I81)","v":{"$error":"#N/A"}},{"$f":"(COUNTIF(D81:I81,\">0\"))","v":0},{"$f":"M83","v":{"$error":"#N/A"}},{"$f":"J81/K81","v":{"$error":"#N/A"}},{"$f":"$J$8-J83","v":{"$error":"#N/A"}}]
["C16",{"$f":"VLOOKUP($A82,datos!$A$4:$AD$52,2)","v":{"$error":"#N/A"}},{"$f":"VLOOKUP($A82,datos!$A$4:$AD$52,3)","v":{"$error":"#N/A"}},{"$f":"VLOOKUP($A82,datos!$A$4:$AD$52,10)","v":{"$error":"#N/A"}},{"$f":"VLOOKUP($A82,datos!$A$4:$AD$52,11)","v":{"$error":"#N/A"}},{"$f":"VLOOKUP($A82,datos!$A$4:$AD$52,12)","v":{"$error":"#N/A"}},{"$f":"VLOOKUP($A82,datos!$A$4:$AD$52,13)","v":{"$error":"#N/A"}},{"$f":"VLOOKUP($A82,datos!$A$4:$AD$52,14)","v":{"$error":"#N/A"}},{"$f":"VLOOKUP($A82,datos!$A$4:$AD$52,15)","v":{"$error":"#N/A"}},{"$f":"SUM(D82:I82)","v":{"$error":"#N/A"}},{"$f":"(COUNTIF(D82:I82,\">0\"))","v":0},{"$f":"M83","v":{"$error":"#N/A"}},{"$f":"J82/K82","v":{"$error":"#N/A"}},"16°"]
[null,null,null,{"$f":"SUM(D81:D82)","v":{"$error":"#N/A"}},{"$error":"#N/A"},{"$error":"#N/A"},{"$error":"#N/A"},{"$error":"#N/A"},{"$error":"#N/A"},{"$error":"#N/A"},{"$f":"(COUNTIF(D83:I83,\">0\"))*2","v":0},{"$f":"M83","v":{"$error":"#N/A"}},{"$f":"J83/K83","v":{"$error":"#N/A"}},null,null,{"$f":"MAX(D53:I53)","v":360}]
[null,null,null,null,null,null,null,null,null,null,null,{"$f":"M83","v":{"$error":"#N/A"}}]
["Cod","Nombre del Jugador","FEDERACION","L1","L2","L3","L4","L5","L6","Serie",null,{"$f":"M88","v":{"$error":"#N/A"}},"Prom","dif"]
["C46",{"$f":"VLOOKUP($A86,datos!$A$4:$AD$52,2)","v":{"$error":"#N/A"}},{"$f":"VLOOKUP($A86,datos!$A$4:$AD$52,3)","v":{"$error":"#N/A"}},{"$f":"VLOOKUP($A86,datos!$A$4:$AD$52,10)","v":{"$error":"#N/A"}},{"$f":"VLOOKUP($A86,datos!$A$4:$AD$52,11)","v":{"$error":"#N/A"}},{"$f":"VLOOKUP($A86,datos!$A$4:$AD$52,12)","v":{"$error":"#N/A"}},{"$f":"VLOOKUP($A86,datos!$A$4:$AD$52,13)","v":{"$error":"#N/A"}},{"$f":"VLOOKUP($A86,datos!$A$4:$AD$52,14)","v":{"$error":"#N/A"}},{"$f":"VLOOKUP($A86,datos!$A$4:$AD$52,15)","v":{"$error":"#N/A"}},{"$f":"SUM(D86:I86)","v":{"$error":"#N/A"}},{"$f":"(COUNTIF(D86:I86,\">0\"))","v":0},{"$f":"M88","v":{"$error":"#N/A"}},{"$f":"J86/K86","v":{"$error":"#N/A"}},{"$f":"$J$8-J88","v":{"$error":"#N/A"}}]
["C45",{"$f":"VLOOKUP($A87,datos!$A$4:$AD$52,2)","v":{"$error":"#N/A"}},{"$f":"VLOOKUP($A87,datos!$A$4:$AD$52,3)","v":{"$error":"#N/A"}},{"$f":"VLOOKUP($A87,datos!$A$4:$AD$52,10)","v":{"$error":"#N/A"}},{"$f":"VLOOKUP($A87,datos!$A$4:$AD$52,11)","v":{"$error":"#N/A"}},{"$f":"VLOOKUP($A87,datos!$A$4:$AD$52,12)","v":{"$error":"#N/A"}},{"$f":"VLOOKUP($A87,datos!$A$4:$AD$52,13)","v":{"$error":"#N/A"}},{"$f":"VLOOKUP($A87,datos!$A$4:$AD$52,14)","v":{"$error":"#N/A"}},{"$f":"VLOOKUP($A87,datos!$A$4:$AD$52,15)","v":{"$error":"#N/A"}},{"$f":"SUM(D87:I87)","v":{"$error":"#N/A"}},{"$f":"(COUNTIF(D87:I87,\">0\"))","v":0},{"$f":"M88","v":{"$error":"#N/A"}},{"$f":"J87/K87","v":{"$error":"#N/A"}},"17°"]
[null,null,null,{"$f":"SUM(D86:D87)","v":{"$error":"#N/A"}},{"$error":"#N/A"},{"$error":"#N/A"},{"$error":"#N/A"},{"$error":"#N/A"},{"$error":"#N/A"},{"$error":"#N/A"},{"$f":"(COUNTIF(D88:I88,\">0\"))*2","v":0},{"$f":"M88","v":{"$error":"#N/A"}},{"$f":"J88/K88","v":{"$error":"#N/A"}},null,null,{"$f":"MAX(D93:I93)","v":{"$error":"#N/A"}}]
[null,null,null,null,null,null,null,null,null,null,null,{"$f":"M88","v":{"$error":"#N/A"}}]
["Cod","Nombre del Jugador","FEDERACION","L1","L2","L3","L4","L5","L6","Serie",null,{"$f":"M93","v":{"$error":"#N/A"}},"Prom","dif"]
["C43",{"$f":"VLOOKUP($A91,datos!$A$4:$AD$52,2)","v":{"$error":"#N/A"}},{"$f":"VLOOKUP($A91,datos!$A$4:$AD$52,3)","v":{"$error":"#N/A"}},{"$f":"VLOOKUP($A91,datos!$A$4:$AD$52,10)","v":{"$error":"#N/A"}},{"$f":"VLOOKUP($A91,datos!$A$4:$AD$52,11)","v":{"$error":"#N/A"}},{"$f":"VLOOKUP($A91,datos!$A$4:$AD$52,12)","v":{"$error":"#N/A"}},{"$f":"VLOOKUP($A91,datos!$A$4:$AD$52,13)","v":{"$error":"#N/A"}},{"$f":"VLOOKUP($A91,datos!$A$4:$AD$52,14)","v":{"$error":"#N/A"}},{"$f":"VLOOKUP($A91,datos!$A$4:$AD$52,15)","v":{"$error":"#N/A"}},{"$f":"SUM(D91:I91)","v":{"$error":"#N/A"}},{"$f":"(COUNTIF(D91:I91,\">0\"))","v":0},{"$f":"M93","v":{"$error":"#N/A"}},{"$f":"J91/K91","v":{"$error":"#N/A"}},{"$f":"$J$8-J93","v":{"$error":"#N/A"}}]
["C44",{"$f":"VLOOKUP($A92,datos!$A$4:$AD$52,2)","v":{"$error":"#N/A"}},{"$f":"VLOOKUP($A92,datos!$A$4:$AD$52,3)","v":{"$error":"#N/A"}},{"$f":"VLOOKUP($A92,datos!$A$4:$AD$52,10)","v":{"$error":"#N/A"}},{"$f":"VLOOKUP($A92,datos!$A$4:$AD$52,11)","v":{"$error":"#N/A"}},{"$f":"VLOOKUP($A92,datos!$A$4:$AD$52,12)","v":{"$error":"#N/A"}},{"$f":"VLOOKUP($A92,datos!$A$4:$AD$52,13)","v":{"$error":"#N/A"}},{"$f":"VLOOKUP($A92,datos!$A$4:$AD$52,14)","v":{"$error":"#N/A"}},{"$f":"VLOOKUP($A92,datos!$A$4:$AD$52,15)","v":{"$error":"#N/A"}},{"$f":"SUM(D92:I92)","v":{"$error":"#N/A"}},{"$f":"(COUNTIF(D92:I92,\">0\"))","v":0},{"$f":"M93","v":{"$error":"#N/A"}},{"$f":"J92/K92","v":{"$error":"#N/A"}},"18°"]
[null,null,null,{"$f":"SUM(D91:D92)","v":{"$error":"#N/A"}},{"$error":"#N/A"},{"$error":"#N/A"},{"$error":"#N/A"},{"$error":"#N/A"},{"$error":"#N/A"},{"$error":"#N/A"},{"$f":"(COUNTIF(D93:I93,\">0\"))*2","v":0},{"$f":"M93","v":{"$error":"#N/A"}},{"$f":"J93/K93","v":{"$error":"#N/A"}},null,null,{"$f":"MAX(D103:I103)","v":{"$error":"#N/A"}}]
[null,null,null,null,null,null,null,null,null,null,null,{"$f":"M93","v":{"$error":"#N/A"}}]
["Cod","Nombre del Jugador","FEDERACION","L1","L2","L3","L4","L5","L6","Serie",null,{"$f":"M98","v":{"$error":"#N/A"}},"Prom","dif"]
["C35",{"$f":"VLOOKUP($A96,datos!$A$4:$AD$52,2)","v":{"$error":"#N/A"}},{"$f":"VLOOKUP($A96,datos!$A$4:$AD$52,3)","v":{"$error":"#N/A"}},{"$f":"VLOOKUP($A96,datos!$A$4:$AD$52,10)","v":{"$error":"#N/A"}},{"$f":"VLOOKUP($A96,datos!$A$4:$AD$52,11)","v":{"$error":"#N/A"}},{"$f":"VLOOKUP($A96,datos!$A$4:$AD$52,12)","v":{"$error":"#N/A"}},{"$f":"VLOOKUP($A96,datos!$A$4:$AD$52,13)","v":{"$error":"#N/A"}},{"$f":"VLOOKUP($A96,datos!$A$4:$AD$52,14)","v":{"$error":"#N/A"}},{"$f":"VLOOKUP($A96,datos!$A$4:$AD$52,15)","v":{"$error":"#N/A"}},{"$f":"SUM(D96:I96)","v":{"$error":"#N/A"}},{"$f":"(COUNTIF(D96:I96,\">0\"))","v":0},{"$f":"M98","v":{"$error":"#N/A"}},{"$f":"J96/K96","v":{"$error":"#N/A"}},{"$f":"$J$8-J98","v":{"$error":"#N/A"}}]
["C31",{"$f":"VLOOKUP($A97,datos!$A$4:$AD$52,2)","v":{"$error":"#N/A"}},{"$f":"VLOOKUP($A97,datos!$A$4:$AD$52,3)","v":{"$error":"#N/A"}},{"$f":"VLOOKUP($A97,datos!$A$4:$AD$52,10)","v":{"$error":"#N/A"}},{"$f":"VLOOKUP($A97,datos!$A$4:$AD$52,11)","v":{"$error":"#N/A"}},{"$f":"VLOOKUP($A97,datos!$A$4:$AD$52,12)","v":{"$error":"#N/A"}},{"$f":"VLOOKUP($A97,datos!$A$4:$AD$52,13)","v":{"$error":"#N/A"}},{"$f":"VLOOKUP($A97,datos!$A$4:$AD$52,14)","v":{"$error":"#N/A"}},{"$f":"VLOOKUP($A97,datos!$A$4:$AD$52,15)","v":{"$error":"#N/A"}},{"$f":"SUM(D97:I97)","v":{"$error":"#N/A"}},{"$f":"(COUNTIF(D97:I97,\">0\"))","v":0},{"$f":"M98","v":{"$error":"#N/A"}},{"$f":"J97/K97","v":{"$error":"#N/A"}},"19°"]
[null,null,null,{"$f":"SUM(D96:D97)","v":{"$error":"#N/A"}},{"$error":"#N/A"},{"$error":"#N/A"},{"$error":"#N/A"},{"$error":"#N/A"},{"$error":"#N/A"},{"$error":"#N/A"},{"$f":"(COUNTIF(D98:I98,\">0\"))*2","v":0},{"$f":"M98","v":{"$error":"#N/A"}},{"$f":"J98/K98","v":{"$error":"#N/A"}},null,null,{"$f":"MAX(D63:I63)","v":309}]
[null,null,null,null,null,null,null,null,null,null,null,{"$f":"M98","v":{"$error":"#N/A"}}]
["Cod","Nombre del Jugador","FEDERACION","L1","L2","L3","L4","L5","L6","Serie",null,{"$f":"M103","v":{"$error":"#N/A"}},"Prom","dif",null,null,{"$f":"(COUNTIF(#REF!,\">0\"))","v":{"$error":"#REF!"}}]
["C10",{"$f":"VLOOKUP($A101,datos!$A$4:$AD$52,2)","v":{"$error":"#N/A"}},{"$f":"VLOOKUP($A101,datos!$A$4:$AD$52,3)","v":{"$error":"#N/A"}},{"$f":"VLOOKUP($A101,datos!$A$4:$AD$52,10)","v":{"$error":"#N/A"}},{"$f":"VLOOKUP($A101,datos!$A$4:$AD$52,11)","v":{"$error":"#N/A"}},{"$f":"VLOOKUP($A101,datos!$A$4:$AD$52,12)","v":{"$error":"#N/A"}},{"$f":"VLOOKUP($A101,datos!$A$4:$AD$52,13)","v":{"$error":"#N/A"}},{"$f":"VLOOKUP($A101,datos!$A$4:$AD$52,14)","v":{"$error":"#N/A"}},{"$f":"VLOOKUP($A101,datos!$A$4:$AD$52,15)","v":{"$error":"#N/A"}},{"$f":"SUM(D101:I101)","v":{"$error":"#N/A"}},{"$f":"(COUNTIF(D101:I101,\">0\"))","v":0},{"$f":"M103","v":{"$error":"#N/A"}},{"$f":"J101/K101","v":{"$error":"#N/A"}},{"$f":"$J$8-J103","v":{"$error":"#N/A"}}]
["C08",{"$f":"VLOOKUP($A102,datos!$A$4:$AD$52,2)","v":{"$error":"#N/A"}},{"$f":"VLOOKUP($A102,datos!$A$4:$AD$52,3)","v":{"$error":"#N/A"}},{"$f":"VLOOKUP($A102,datos!$A$4:$AD$52,10)","v":{"$error":"#N/A"}},{"$f":"VLOOKUP($A102,datos!$A$4:$AD$52,11)","v":{"$error":"#N/A"}},{"$f":"VLOOKUP($A102,datos!$A$4:$AD$52,12)","v":{"$error":"#N/A"}},{"$f":"VLOOKUP($A102,datos!$A$4:$AD$52,13)","v":{"$error":"#N/A"}},{"$f":"VLOOKUP($A102,datos!$A$4:$AD$52,14)","v":{"$error":"#N/A"}},{"$f":"VLOOKUP($A102,datos!$A$4:$AD$52,15)","v":{"$error":"#N/A"}},{"$f":"SUM(D102:I102)","v":{"$error":"#N/A"}},{"$f":"(COUNTIF(D102:I102,\">0\"))","v":0},{"$f":"M103","v":{"$error":"#N/A"}},{"$f":"J102/K102","v":{"$error":"#N/A"}},"20°"]
[null,null,null,{"$f":"SUM(D101:D102)","v":{"$error":"#N/A"}},{"$error":"#N/A"},{"$error":"#N/A"},{"$error":"#N/A"},{"$error":"#N/A"},{"$error":"#N/A"},{"$error":"#N/A"},{"$f":"(COUNTIF(D103:I103,\">0\"))*2","v":0},{"$f":"M103","v":{"$error":"#N/A"}},{"$f":"J103/K103","v":{"$error":"#N/A"}},null,null,{"$f":"MAX(D108:I108)","v":{"$error":"#N/A"}}]
[null,null,null,null,null,null,null,null,null,null,null,{"$f":"M103","v":{"$error":"#N/A"}}]
["Cod","Nombre del Jugador","FEDERACION","L1","L2","L3","L4","L5","L6","Serie",null,{"$f":"M108","v":{"$error":"#N/A"}},"Prom","dif"]
["C18",{"$f":"VLOOKUP($A106,datos!$A$4:$AD$52,2)","v":{"$error":"#N/A"}},{"$f":"VLOOKUP($A106,datos!$A$4:$AD$52,3)","v":{"$error":"#N/A"}},{"$f":"VLOOKUP($A106,datos!$A$4:$AD$52,10)","v":{"$error":"#N/A"}},{"$f":"VLOOKUP($A106,datos!$A$4:$AD$52,11)","v":{"$error":"#N/A"}},{"$f":"VLOOKUP($A106,datos!$A$4:$AD$52,12)","v":{"$error":"#N/A"}},{"$f":"VLOOKUP($A106,datos!$A$4:$AD$52,13)","v":{"$error":"#N/A"}},{"$f":"VLOOKUP($A106,datos!$A$4:$AD$52,14)","v":{"$error":"#N/A"}},{"$f":"VLOOKUP($A106,datos!$A$4:$AD$52,15)","v":{"$error":"#N/A"}},{"$f":"SUM(D106:I106)","v":{"$error":"#N/A"}},{"$f":"(COUNTIF(D106:I106,\">0\"))","v":0},{"$f":"M108","v":{"$error":"#N/A"}},{"$f":"J106/K106","v":{"$error":"#N/A"}},{"$f":"$J$8-J108","v":{"$error":"#N/A"}}]
["C17",{"$f":"VLOOKUP($A107,datos!$A$4:$AD$52,2)","v":{"$error":"#N/A"}},{"$f":"VLOOKUP($A107,datos!$A$4:$AD$52,3)","v":{"$error":"#N/A"}},{"$f":"VLOOKUP($A107,datos!$A$4:$AD$52,10)","v":{"$error":"#N/A"}},{"$f":"VLOOKUP($A107,datos!$A$4:$AD$52,11)","v":{"$error":"#N/A"}},{"$f":"VLOOKUP($A107,datos!$A$4:$AD$52,12)","v":{"$error":"#N/A"}},{"$f":"VLOOKUP($A107,datos!$A$4:$AD$52,13)","v":{"$error":"#N/A"}},{"$f":"VLOOKUP($A107,datos!$A$4:$AD$52,14)","v":{"$error":"#N/A"}},{"$f":"VLOOKUP($A107,datos!$A$4:$AD$52,15)","v":{"$error":"#N/A"}},{"$f":"SUM(D107:I107)","v":{"$error":"#N/A"}},{"$f":"(COUNTIF(D107:I107,\">0\"))","v":0},{"$f":"M108","v":{"$error":"#N/A"}},{"$f":"J107/K107","v":{"$error":"#N/A"}},"21°"]
[null,null,null,{"$f":"SUM(D106:D107)","v":{"$error":"#N/A"}},{"$error":"#N/A"},{"$error":"#N/A"},{"$error":"#N/A"},{"$error":"#N/A"},{"$error":"#N/A"},{"$error":"#N/A"},{"$f":"(COUNTIF(D108:I108,\">0\"))*2","v":0},{"$f":"M108","v":{"$error":"#N/A"}},{"$f":"J108/K108","v":{"$error":"#N/A"}},null,null,{"$f":"MAX(D48:I48)","v":387}]
[null,null,null,null,null,null,null,null,null,null,null,{"$f":"M108","v":{"$error":"#N/A"}}]
["Cod","Nombre del Jugador","FEDERACION","L1","L2","L3","L4","L5","L6","Serie",null,{"$f":"M113","v":{"$error":"#N/A"}},"Prom","dif"]
["C09",{"$f":"VLOOKUP($A111,datos!$A$4:$AD$52,2)","v":{"$error":"#N/A"}},{"$f":"VLOOKUP($A111,datos!$A$4:$AD$52,3)","v":{"$error":"#N/A"}},{"$f":"VLOOKUP($A111,datos!$A$4:$AD$52,10)","v":{"$error":"#N/A"}},{"$f":"VLOOKUP($A111,datos!$A$4:$AD$52,11)","v":{"$error":"#N/A"}},{"$f":"VLOOKUP($A111,datos!$A$4:$AD$52,12)","v":{"$error":"#N/A"}},{"$f":"VLOOKUP($A111,datos!$A$4:$AD$52,13)","v":{"$error":"#N/A"}},{"$f":"VLOOKUP($A111,datos!$A$4:$AD$52,14)","v":{"$error":"#N/A"}},{"$f":"VLOOKUP($A111,datos!$A$4:$AD$52,15)","v":{"$error":"#N/A"}},{"$f":"SUM(D111:I111)","v":{"$error":"#N/A"}},{"$f":"(COUNTIF(D111:I111,\">0\"))","v":0},{"$f":"M113","v":{"$error":"#N/A"}},{"$f":"J111/K111","v":{"$error":"#N/A"}},{"$f":"$J$8-J113","v":{"$error":"#N/A"}}]
["C12",{"$f":"VLOOKUP($A112,datos!$A$4:$AD$52,2)","v":{"$error":"#N/A"}},{"$f":"VLOOKUP($A112,datos!$A$4:$AD$52,3)","v":{"$error":"#N/A"}},{"$f":"VLOOKUP($A112,datos!$A$4:$AD$52,10)","v":{"$error":"#N/A"}},{"$f":"VLOOKUP($A112,datos!$A$4:$AD$52,11)","v":{"$error":"#N/A"}},{"$f":"VLOOKUP($A112,datos!$A$4:$AD$52,12)","v":{"$error":"#N/A"}},{"$f":"VLOOKUP($A112,datos!$A$4:$AD$52,13)","v":{"$error":"#N/A"}},{"$f":"VLOOKUP($A112,datos!$A$4:$AD$52,14)","v":{"$error":"#N/A"}},{"$f":"VLOOKUP($A112,datos!$A$4:$AD$52,15)","v":{"$error":"#N/A"}},{"$f":"SUM(D112:I112)","v":{"$error":"#N/A"}},{"$f":"(COUNTIF(D112:I112,\">0\"))","v":0},{"$f":"M113","v":{"$error":"#N/A"}},{"$f":"J112/K112","v":{"$error":"#N/A"}},"22°"]
[null,null,null,{"$f":"SUM(D111:D112)","v":{"$error":"#N/A"}},{"$error":"#N/A"},{"$error":"#N/A"},{"$error":"#N/A"},{"$error":"#N/A"},{"$error":"#N/A"},{"$error":"#N/A"},{"$f":"(COUNTIF(D113:I113,\">0\"))*2","v":0},{"$f":"M113","v":{"$error":"#N/A"}},{"$f":"J113/K113","v":{"$error":"#N/A"}},null,null,{"$f":"MAX(D88:I88)","v":{"$error":"#N/A"}}]
[null,null,null,null,null,null,null,null,null,null,null,{"$f":"M113","v":{"$error":"#N/A"}}]
["Cod","Nombre del Jugador","FEDERACION","L1","L2","L3","L4","L5","L6","Serie",null,{"$f":"M118","v":{"$error":"#N/A"}},"Prom","dif"]
["C47",{"$f":"VLOOKUP($A116,datos!$A$4:$AD$52,2)","v":{"$error":"#N/A"}},{"$f":"VLOOKUP($A116,datos!$A$4:$AD$52,3)","v":{"$error":"#N/A"}},{"$f":"VLOOKUP($A116,datos!$A$4:$AD$52,10)","v":{"$error":"#N/A"}},{"$f":"VLOOKUP($A116,datos!$A$4:$AD$52,11)","v":{"$error":"#N/A"}},{"$f":"VLOOKUP($A116,datos!$A$4:$AD$52,12)","v":{"$error":"#N/A"}},{"$f":"VLOOKUP($A116,datos!$A$4:$AD$52,13)","v":{"$error":"#N/A"}},{"$f":"VLOOKUP($A116,datos!$A$4:$AD$52,14)","v":{"$error":"#N/A"}},{"$f":"VLOOKUP($A116,datos!$A$4:$AD$52,15)","v":{"$error":"#N/A"}},{"$f":"SUM(D116:I116)","v":{"$error":"#N/A"}},{"$f":"(COUNTIF(D116:I116,\">0\"))","v":0},{"$f":"M118","v":{"$error":"#N/A"}},{"$f":"J116/K116","v":{"$error":"#N/A"}},{"$f":"$J$8-J118","v":{"$error":"#N/A"}}]
["C48",{"$f":"VLOOKUP($A117,datos!$A$4:$AD$52,2)","v":{"$error":"#N/A"}},{"$f":"VLOOKUP($A117,datos!$A$4:$AD$52,3)","v":{"$error":"#N/A"}},{"$f":"VLOOKUP($A117,datos!$A$4:$AD$52,10)","v":{"$error":"#N/A"}},{"$f":"VLOOKUP($A117,datos!$A$4:$AD$52,11)","v":{"$error":"#N/A"}},{"$f":"VLOOKUP($A117,datos!$A$4:$AD$52,12)","v":{"$error":"#N/A"}},{"$f":"VLOOKUP($A117,datos!$A$4:$AD$52,13)","v":{"$error":"#N/A"}},{"$f":"VLOOKUP($A117,datos!$A$4:$AD$52,14)","v":{"$error":"#N/A"}},{"$f":"VLOOKUP($A117,datos!$A$4:$AD$52,15)","v":{"$error":"#N/A"}},{"$f":"SUM(D117:I117)","v":{"$error":"#N/A"}},{"$f":"(COUNTIF(D117:I117,\">0\"))","v":0},{"$f":"M118","v":{"$error":"#N/A"}},{"$f":"J117/K117","v":{"$error":"#N/A"}},"23°"]
[null,null,null,{"$f":"SUM(D116:D117)","v":{"$error":"#N/A"}},{"$error":"#N/A"},{"$error":"#N/A"},{"$error":"#N/A"},{"$error":"#N/A"},{"$error":"#N/A"},{"$error":"#N/A"},{"$f":"(COUNTIF(D118:I118,\">0\"))*2","v":0},{"$f":"M118","v":{"$error":"#N/A"}},{"$f":"J118/K118","v":{"$error":"#N/A"}},null,null,{"$f":"MAX(D93:I93)","v":{"$error":"#N/A"}}]
[null,null,null,null,null,null,null,null,null,null,null,{"$f":"M118","v":{"$error":"#N/A"}}]
["Cod","Nombre del Jugador","FEDERACION","L1","L2","L3","L4","L5","L6","Serie",null,{"$f":"M123","v":{"$error":"#N/A"}},"Prom","dif"]
["C21",{"$f":"VLOOKUP($A121,datos!$A$4:$AD$52,2)","v":{"$error":"#N/A"}},{"$f":"VLOOKUP($A121,datos!$A$4:$AD$52,3)","v":{"$error":"#N/A"}},{"$f":"VLOOKUP($A121,datos!$A$4:$AD$52,10)","v":{"$error":"#N/A"}},{"$f":"VLOOKUP($A121,datos!$A$4:$AD$52,11)","v":{"$error":"#N/A"}},{"$f":"VLOOKUP($A121,datos!$A$4:$AD$52,12)","v":{"$error":"#N/A"}},{"$f":"VLOOKUP($A121,datos!$A$4:$AD$52,13)","v":{"$error":"#N/A"}},{"$f":"VLOOKUP($A121,datos!$A$4:$AD$52,14)","v":{"$error":"#N/A"}},{"$f":"VLOOKUP($A121,datos!$A$4:$AD$52,15)","v":{"$error":"#N/A"}},{"$f":"SUM(D121:I121)","v":{"$error":"#N/A"}},{"$f":"(COUNTIF(D121:I121,\">0\"))","v":0},{"$f":"M123","v":{"$error":"#N/A"}},{"$f":"J121/K121","v":{"$error":"#N/A"}},{"$f":"$J$8-J123","v":{"$error":"#N/A"}}]
["C19",{"$f":"VLOOKUP($A122,datos!$A$4:$AD$52,2)","v":{"$error":"#N/A"}},{"$f":"VLOOKUP($A122,datos!$A$4:$AD$52,3)","v":{"$error":"#N/A"}},{"$f":"VLOOKUP($A122,datos!$A$4:$AD$52,10)","v":{"$error":"#N/A"}},{"$f":"VLOOKUP($A122,datos!$A$4:$AD$52,11)","v":{"$error":"#N/A"}},{"$f":"VLOOKUP($A122,datos!$A$4:$AD$52,12)","v":{"$error":"#N/A"}},{"$f":"VLOOKUP($A122,datos!$A$4:$AD$52,13)","v":{"$error":"#N/A"}},{"$f":"VLOOKUP($A122,datos!$A$4:$AD$52,14)","v":{"$error":"#N/A"}},{"$f":"VLOOKUP($A122,datos!$A$4:$AD$52,15)","v":{"$error":"#N/A"}},{"$f":"SUM(D122:I122)","v":{"$error":"#N/A"}},{"$f":"(COUNTIF(D122:I122,\">0\"))","v":0},{"$f":"M123","v":{"$error":"#N/A"}},{"$f":"J122/K122","v":{"$error":"#N/A"}},"24°"]
[null,null,null,{"$f":"SUM(D121:D122)","v":{"$error":"#N/A"}},{"$error":"#N/A"},{"$error":"#N/A"},{"$error":"#N/A"},{"$error":"#N/A"},{"$error":"#N/A"},{"$error":"#N/A"},{"$f":"(COUNTIF(D123:I123,\">0\"))*2","v":0},{"$f":"M123","v":{"$error":"#N/A"}},{"$f":"J123/K123","v":{"$error":"#N/A"}},null,null,{"$f":"MAX(D98:I98)","v":{"$error":"#N/A"}}]
[null,null,null,null,null,null,null,null,null,null,null,{"$f":"M123","v":{"$error":"#N/A"}}]

{"sheet":"TER","index":3,"n_rows":52,"n_cols":16,"rows_kept":52,"cut":false,"hidden":false,"merged":[[49,13,50,13],[25,13,26,13],[37,13,38,13],[3,1,3,13],[19,13,20,13],[31,13,32,13],[1,0,1,13],[2,0,2,13],[43,13,44,13],[7,13,8,13],[13,13,14,13]]}
[]
["  CAMPEONATO SUDAMERICANO JUVENIL 2014"]
["TRIOS  SUB 20"]
[]
["Cod","Nombre del Jugador","FEDERACION","L1","L2","L3","L4","L5","L6","Serie",null,{"$f":"J9","v":3796},"Prom"]
["j23",{"$f":"VLOOKUP($A6,datos!$A$4:$AD$52,2)","v":"JOAO I. FERREIRA N. "},{"$f":"VLOOKUP($A6,datos!$A$4:$AD$52,3)","v":"Brasil"},{"$f":"VLOOKUP($A6,datos!$A$4:$AD$52,16)","v":212},{"$f":"VLOOKUP($A6,datos!$A$4:$AD$52,17)","v":200},{"$f":"VLOOKUP($A6,datos!$A$4:$AD$52,18)","v":256},{"$f":"VLOOKUP($A6,datos!$A$4:$AD$52,19)","v":156},{"$f":"VLOOKUP($A6,datos!$A$4:$AD$52,20)","v":186},{"$f":"VLOOKUP($A6,datos!$A$4:$AD$52,21)","v":194},{"$f":"SUM(D6:I6)","v":1204},{"$f":"COUNTIF(D6:I6,\">0\")","v":6},{"$f":"J9","v":3796},{"$f":"J6/K6","v":200.66666666666666},"dif"]
["j22",{"$f":"VLOOKUP($A7,datos!$A$4:$AD$52,2)","v":"THIAGO FELICETTI"},{"$f":"VLOOKUP($A7,datos!$A$4:$AD$52,3)","v":"Brasil"},{"$f":"VLOOKUP($A7,datos!$A$4:$AD$52,16)","v":180},{"$f":"VLOOKUP($A7,datos!$A$4:$AD$52,17)","v":184},{"$f":"VLOOKUP($A7,datos!$A$4:$AD$52,18)","v":233},{"$f":"VLOOKUP($A7,datos!$A$4:$AD$52,19)","v":235},{"$f":"VLOOKUP($A7,datos!$A$4:$AD$52,20)","v":180},{"$f":"VLOOKUP($A7,datos!$A$4:$AD$52,21)","v":162},{"$f":"SUM(D7:I7)","v":1174},{"$f":"COUNTIF(D7:I7,\">0\")","v":6},{"$f":"J9","v":3796},{"$f":"J7/K7","v":195.66666666666666},{"$f":"MAX($J$51,$J$45,$J$27,$J$39,$J$21,$J$33,$J$9,$J$15)-J9","v":0}]
["j20",{"$f":"VLOOKUP($A8,datos!$A$4:$AD$52,2)","v":"BRUNO COSTA S"},{"$f":"VLOOKUP($A8,datos!$A$4:$AD$52,3)","v":"Brasil"},{"$f":"VLOOKUP($A8,datos!$A$4:$AD$52,16)","v":182},{"$f":"VLOOKUP($A8,datos!$A$4:$AD$52,17)","v":277},{"$f":"VLOOKUP($A8,datos!$A$4:$AD$52,18)","v":225},{"$f":"VLOOKUP($A8,datos!$A$4:$AD$52,19)","v":254},{"$f":"VLOOKUP($A8,datos!$A$4:$AD$52,20)","v":267},{"$f":"VLOOKUP($A8,datos!$A$4:$AD$52,21)","v":213},{"$f":"SUM(D8:I8)","v":1418},{"$f":"COUNTIF(D8:I8,\">0\")","v":6},{"$f":"J9","v":3796},{"$f":"J8/K8","v":236.33333333333334},1]
[null,null,null,{"$f":"SUM(D6:D8)","v":574},661,714,645,633,569,3796,{"$f":"COUNTIF(D9:I9,\">0\")*3","v":18},{"$f":"J9","v":3796},{"$f":"J9/K9","v":210.88888888888889},null,null,{"$f":"MAX(D39:I39)","v":631}]
[null,null,null,null,null,null,null,null,null,null,null,{"$f":"J9","v":3796}]
["Cod","Nombre del Jugador","FEDERACION","L1","L2","L3","L4","L5","L6","Serie",null,{"$f":"J15","v":3670},"Prom"]
["j27",{"$f":"VLOOKUP($A12,datos!$A$4:$AD$52,2)","v":"JORGE FIGUEROA"},{"$f":"VLOOKUP($A12,datos!$A$4:$AD$52,3)","v":"Colombia"},{"$f":"VLOOKUP($A12,datos!$A$4:$AD$52,16)","v":219},{"$f":"VLOOKUP($A12,datos!$A$4:$AD$52,17)","v":175},{"$f":"VLOOKUP($A12,datos!$A$4:$AD$52,18)","v":223},{"$f":"VLOOKUP($A12,datos!$A$4:$AD$52,19)","v":243},{"$f":"VLOOKUP($A12,datos!$A$4:$AD$52,20)","v":214},{"$f":"VLOOKUP($A12,datos!$A$4:$AD$52,21)","v":182},{"$f":"SUM(D12:I12)","v":1256},{"$f":"COUNTIF(D12:I12,\">0\")","v":6},{"$f":"J15","v":3670},{"$f":"J12/K12","v":209.33333333333334},"dif"]
["j26",{"$f":"VLOOKUP($A13,datos!$A$4:$AD$52,2)","v":"SEBASTIAN CHARRY"},{"$f":"VLOOKUP($A13,datos!$A$4:$AD$52,3)","v":"Colombia"},{"$f":"VLOOKUP($A13,datos!$A$4:$AD$52,16)","v":168},{"$f":"VLOOKUP($A13,datos!$A$4:$AD$52,17)","v":239},{"$f":"VLOOKUP($A13,datos!$A$4:$AD$52,18)","v":211},{"$f":"VLOOKUP($A13,datos!$A$4:$AD$52,19)","v":216},{"$f":"VLOOKUP($A13,datos!$A$4:$AD$52,20)","v":198},{"$f":"VLOOKUP($A13,datos!$A$4:$AD$52,21)","v":193},{"$f":"SUM(D13:I13)","v":1225},{"$f":"COUNTIF(D13:I13,\">0\")","v":6},{"$f":"J15","v":3670},204.16666666666666,{"$f":"MAX($J$51,$J$45,$J$27,$J$39,$J$21,$J$33,$J$9,$J$15)-J15","v":126}]
["j24",{"$f":"VLOOKUP($A14,datos!$A$4:$AD$52,2)","v":"CARLOS F. SAAVEDRA"},{"$f":"VLOOKUP($A14,datos!$A$4:$AD$52,3)","v":"Colombia"},{"$f":"VLOOKUP($A14,datos!$A$4:$AD$52,16)","v":150},{"$f":"VLOOKUP($A14,datos!$A$4:$AD$52,17)","v":204},{"$f":"VLOOKUP($A14,datos!$A$4:$AD$52,18)","v":217},{"$f":"VLOOKUP($A14,datos!$A$4:$AD$52,19)","v":227},{"$f":"VLOOKUP($A14,datos!$A$4:$AD$52,20)","v":197},{"$f":"VLOOKUP($A14,datos!$A$4:$AD$52,21)","v":194},{"$f":"SUM(D14:I14)","v":1189},{"$f":"COUNTIF(D14:I14,\">0\")","v":6},{"$f":"J15","v":3670},198.16666666666666,2]
[null,null,null,{"$f":"SUM(D12:D14)","v":537},618,651,686,609,569,3670,{"$f":"COUNTIF(D15:I15,\">0\")*3","v":18},{"$f":"J15","v":3670},203.88888888888889,null,null,{"$f":"MAX(#REF!)","v":{"$error":"#REF!"}}]
[null,null,null,null,null,null,null,null,null,null,null,{"$f":"J15","v":3670}]
["Cod","Nombre del Jugador","FEDERACION","L1","L2","L3","L4","L5","L6","Serie",null,{"$f":"J21","v":3439},"Prom"]
["j13",{"$f":"VLOOKUP($A18,datos!$A$4:$AD$52,2)","v":"FRANCO R. GUALINI"},{"$f":"VLOOKUP($A18,datos!$A$4:$AD$52,3)","v":"Argentina"},{"$f":"VLOOKUP($A18,datos!$A$4:$AD$52,16)","v":187},{"$f":"VLOOKUP($A18,datos!$A$4:$AD$52,17)","v":160},{"$f":"VLOOKUP($A18,datos!$A$4:$AD$52,18)","v":229},{"$f":"VLOOKUP($A18,datos!$A$4:$AD$52,19)","v":203},{"$f":"VLOOKUP($A18,datos!$A$4:$AD$52,20)","v":189},{"$f":"VLOOKUP($A18,datos!$A$4:$AD$52,21)","v":224},{"$f":"SUM(D18:I18)","v":1192},{"$f":"COUNTIF(D18:I18,\">0\")","v":6},{"$f":"J21","v":3439},{"$f":"J18/K18","v":198.66666666666666},"dif"]
["j14",{"$f":"VLOOKUP($A19,datos!$A$4:$AD$52,2)","v":"FABRICIO E. SANDUAY"},{"$f":"VLOOKUP($A19,datos!$A$4:$AD$52,3)","v":"Argentina"},{"$f":"VLOOKUP($A19,datos!$A$4:$AD$52,16)","v":202},{"$f":"VLOOKUP($A19,datos!$A$4:$AD$52,17)","v":162},{"$f":"VLOOKUP($A19,datos!$A$4:$AD$52,18)","v":161},{"$f":"VLOOKUP($A19,datos!$A$4:$AD$52,19)","v":176},{"$f":"VLOOKUP($A19,datos!$A$4:$AD$52,20)","v":211},{"$f":"VLOOKUP($A19,datos!$A$4:$AD$52,21)","v":194},{"$f":"SUM(D19:I19)","v":1106},{"$f":"COUNTIF(D19:I19,\">0\")","v":6},{"$f":"J21","v":3439},184.33333333333334,{"$f":"MAX($J$51,$J$45,$J$27,$J$39,$J$21,$J$33,$J$9,$J$15)-J21","v":357}]
["j15",{"$f":"VLOOKUP($A20,datos!$A$4:$AD$52,2)","v":"FERNANDO TAPIA M."},{"$f":"VLOOKUP($A20,datos!$A$4:$AD$52,3)","v":"Argentina"},{"$f":"VLOOKUP($A20,datos!$A$4:$AD$52,16)","v":206},{"$f":"VLOOKUP($A20,datos!$A$4:$AD$52,17)","v":182},{"$f":"VLOOKUP($A20,datos!$A$4:$AD$52,18)","v":179},{"$f":"VLOOKUP($A20,datos!$A$4:$AD$52,19)","v":201},{"$f":"VLOOKUP($A20,datos!$A$4:$AD$52,20)","v":202},{"$f":"VLOOKUP($A20,datos!$A$4:$AD$52,21)","v":171},{"$f":"SUM(D20:I20)","v":1141},{"$f":"COUNTIF(D20:I20,\">0\")","v":6},{"$f":"J21","v":3439},190.16666666666666,3]
[null,null,null,{"$f":"SUM(D18:D20)","v":595},504,569,580,602,589,3439,{"$f":"COUNTIF(D21:I21,\">0\")*3","v":18},{"$f":"J21","v":3439},191.05555555555554,null,null,{"$f":"MAX(D21:I21)","v":602}]
[null,null,null,null,null,null,null,null,null,null,null,{"$f":"J21","v":3439}]
["Cod","Nombre del Jugador","FEDERACION","L1","L2","L3","L4","L5","L6","Serie",null,{"$f":"J27","v":3508},"Prom"]
["j17",{"$f":"VLOOKUP($A24,datos!$A$4:$AD$52,2)","v":"YANNICK ROOS"},{"$f":"VLOOKUP($A24,datos!$A$4:$AD$52,3)","v":"Aruba"},{"$f":"VLOOKUP($A24,datos!$A$4:$AD$52,16)","v":195},{"$f":"VLOOKUP($A24,datos!$A$4:$AD$52,17)","v":180},{"$f":"VLOOKUP($A24,datos!$A$4:$AD$52,18)","v":193},{"$f":"VLOOKUP($A24,datos!$A$4:$AD$52,19)","v":182},{"$f":"VLOOKUP($A24,datos!$A$4:$AD$52,20)","v":233},{"$f":"VLOOKUP($A24,datos!$A$4:$AD$52,21)","v":200},{"$f":"SUM(D24:I24)","v":1183},{"$f":"COUNTIF(D24:I24,\">0\")","v":6},{"$f":"J27","v":3508},{"$f":"J24/K24","v":197.16666666666666},"dif"]
["j19",{"$f":"VLOOKUP($A25,datos!$A$4:$AD$52,2)","v":"ELIAS HALABI"},{"$f":"VLOOKUP($A25,datos!$A$4:$AD$52,3)","v":"Aruba"},{"$f":"VLOOKUP($A25,datos!$A$4:$AD$52,16)","v":178},{"$f":"VLOOKUP($A25,datos!$A$4:$AD$52,17)","v":167},{"$f":"VLOOKUP($A25,datos!$A$4:$AD$52,18)","v":178},{"$f":"VLOOKUP($A25,datos!$A$4:$AD$52,19)","v":210},{"$f":"VLOOKUP($A25,datos!$A$4:$AD$52,20)","v":170},{"$f":"VLOOKUP($A25,datos!$A$4:$AD$52,21)","v":188},{"$f":"SUM(D25:I25)","v":1091},{"$f":"COUNTIF(D25:I25,\">0\")","v":6},{"$f":"J27","v":3508},181.83333333333334,{"$f":"MAX($J$51,$J$45,$J$27,$J$39,$J$21,$J$33,$J$9,$J$15)-J27","v":288}]
["j16",{"$f":"VLOOKUP($A26,datos!$A$4:$AD$52,2)","v":"BRIAN HELMEYER"},{"$f":"VLOOKUP($A26,datos!$A$4:$AD$52,3)","v":"Aruba"},{"$f":"VLOOKUP($A26,datos!$A$4:$AD$52,16)","v":227},{"$f":"VLOOKUP($A26,datos!$A$4:$AD$52,17)","v":245},{"$f":"VLOOKUP($A26,datos!$A$4:$AD$52,18)","v":187},{"$f":"VLOOKUP($A26,datos!$A$4:$AD$52,19)","v":197},{"$f":"VLOOKUP($A26,datos!$A$4:$AD$52,20)","v":211},{"$f":"VLOOKUP($A26,datos!$A$4:$AD$52,21)","v":167},{"$f":"SUM(D26:I26)","v":1234},{"$f":"COUNTIF(D26:I26,\">0\")","v":6},{"$f":"J27","v":3508},205.66666666666666,4]
[null,null,null,{"$f":"SUM(D24:D26)","v":600},592,558,589,614,555,3508,{"$f":"COUNTIF(D27:I27,\">0\")*3","v":18},{"$f":"J27","v":3508},194.88888888888889,null,null,{"$f":"MAX(D33:I33)","v":595}]
[null,null,null,null,null,null,null,null,null,null,null,{"$f":"J27","v":3508}]
["Cod","Nombre del Jugador","FEDERACION","L1","L2","L3","L4","L5","L6","Serie",null,{"$f":"J33","v":3182},"Prom"]
["j33",{"$f":"VLOOKUP($A30,datos!$A$4:$AD$52,2)","v":"JUAN ANDRES YUZURIHA"},{"$f":"VLOOKUP($A30,datos!$A$4:$AD$52,3)","v":"Perú"},{"$f":"VLOOKUP($A30,datos!$A$4:$AD$52,16)","v":233},{"$f":"VLOOKUP($A30,datos!$A$4:$AD$52,17)","v":188},{"$f":"VLOOKUP($A30,datos!$A$4:$AD$52,18)","v":188},{"$f":"VLOOKUP($A30,datos!$A$4:$AD$52,19)","v":170},{"$f":"VLOOKUP($A30,datos!$A$4:$AD$52,20)","v":164},{"$f":"VLOOKUP($A30,datos!$A$4:$AD$52,21)","v":175},{"$f":"SUM(D30:I30)","v":1118},{"$f":"COUNTIF(D30:I30,\">0\")","v":6},{"$f":"J33","v":3182},{"$f":"J30/K30","v":186.33333333333334},"dif"]
["j32",{"$f":"VLOOKUP($A31,datos!$A$4:$AD$52,2)","v":"ADRIAN GUIBU K."},{"$f":"VLOOKUP($A31,datos!$A$4:$AD$52,3)","v":"Perú"},{"$f":"VLOOKUP($A31,datos!$A$4:$AD$52,16)","v":177},{"$f":"VLOOKUP($A31,datos!$A$4:$AD$52,17)","v":196},{"$f":"VLOOKUP($A31,datos!$A$4:$AD$52,18)","v":172},{"$f":"VLOOKUP($A31,datos!$A$4:$AD$52,19)","v":151},{"$f":"VLOOKUP($A31,datos!$A$4:$AD$52,20)","v":200},{"$f":"VLOOKUP($A31,datos!$A$4:$AD$52,21)","v":148},{"$f":"SUM(D31:I31)","v":1044},{"$f":"COUNTIF(D31:I31,\">0\")","v":6},{"$f":"J33","v":3182},174,{"$f":"MAX($J$51,$J$45,$J$27,$J$39,$J$21,$J$33,$J$9,$J$15)-J33","v":614}]
["j35",{"$f":"VLOOKUP($A32,datos!$A$4:$AD$52,2)","v":"RENZO GUIBU K."},{"$f":"VLOOKUP($A32,datos!$A$4:$AD$52,3)","v":"Perú"},{"$f":"VLOOKUP($A32,datos!$A$4:$AD$52,16)","v":148},{"$f":"VLOOKUP($A32,datos!$A$4:$AD$52,17)","v":211},{"$f":"VLOOKUP($A32,datos!$A$4:$AD$52,18)","v":157},{"$f":"VLOOKUP($A32,datos!$A$4:$AD$52,19)","v":178},{"$f":"VLOOKUP($A32,datos!$A$4:$AD$52,20)","v":138},{"$f":"VLOOKUP($A32,datos!$A$4:$AD$52,21)","v":188},{"$f":"SUM(D32:I32)","v":1020},{"$f":"COUNTIF(D32:I32,\">0\")","v":6},{"$f":"J33","v":3182},170,5]
[null,null,null,{"$f":"SUM(D30:D32)","v":558},595,517,499,502,511,3182,{"$f":"COUNTIF(D33:I33,\">0\")*3","v":18},{"$f":"J33","v":3182},176.77777777777777,null,null,{"$f":"MAX(D9:I9)","v":714}]
[null,null,null,null,null,null,null,null,null,null,null,{"$f":"J33","v":3182}]
["Cod","Nombre del Jugador","FEDERACION","L1","L2","L3","L4","L5","L6","Serie",null,{"$f":"J39","v":3049},"Prom"]
["j12",{"$f":"VLOOKUP($A36,datos!$A$4:$AD$52,2)","v":"AGUSTIN LEANDRO A."},{"$f":"VLOOKUP($A36,datos!$A$4:$AD$52,3)","v":"Argentina"},{"$f":"VLOOKUP($A36,datos!$A$4:$AD$52,16)","v":138},{"$f":"VLOOKUP($A36,datos!$A$4:$AD$52,17)","v":177},{"$f":"VLOOKUP($A36,datos!$A$4:$AD$52,18)","v":180},{"$f":"VLOOKUP($A36,datos!$A$4:$AD$52,19)","v":184},{"$f":"VLOOKUP($A36,datos!$A$4:$AD$52,20)","v":221},{"$f":"VLOOKUP($A36,datos!$A$4:$AD$52,21)","v":153},{"$f":"SUM(D36:I36)","v":1053},{"$f":"COUNTIF(D36:I36,\">0\")","v":6},{"$f":"J39","v":3049},{"$f":"J36/K36","v":175.5},"dif"]
["j34",{"$f":"VLOOKUP($A37,datos!$A$4:$AD$52,2)","v":"KEIJI M. CAJACHACAHUA M."},{"$f":"VLOOKUP($A37,datos!$A$4:$AD$52,3)","v":"Perú"},{"$f":"VLOOKUP($A37,datos!$A$4:$AD$52,16)","v":245},{"$f":"VLOOKUP($A37,datos!$A$4:$AD$52,17)","v":187},{"$f":"VLOOKUP($A37,datos!$A$4:$AD$52,18)","v":166},{"$f":"VLOOKUP($A37,datos!$A$4:$AD$52,19)","v":169},{"$f":"VLOOKUP($A37,datos!$A$4:$AD$52,20)","v":234},{"$f":"VLOOKUP($A37,datos!$A$4:$AD$52,21)","v":206},{"$f":"SUM(D37:I37)","v":1207},{"$f":"COUNTIF(D37:I37,\">0\")","v":6},{"$f":"J39","v":3049},201.16666666666666,{"$f":"MAX($J$51,$J$45,$J$27,$J$39,$J$21,$J$33,$J$9,$J$15)-J39","v":747}]
["j31",{"$f":"VLOOKUP($A38,datos!$A$4:$AD$52,2)","v":"LUIS JEREZ G."},{"$f":"VLOOKUP($A38,datos!$A$4:$AD$52,3)","v":"Chile"},{"$f":"VLOOKUP($A38,datos!$A$4:$AD$52,16)","v":125},{"$f":"VLOOKUP($A38,datos!$A$4:$AD$52,17)","v":115},{"$f":"VLOOKUP($A38,datos!$A$4:$AD$52,18)","v":89},{"$f":"VLOOKUP($A38,datos!$A$4:$AD$52,19)","v":133},{"$f":"VLOOKUP($A38,datos!$A$4:$AD$52,20)","v":176},{"$f":"VLOOKUP($A38,datos!$A$4:$AD$52,21)","v":151},{"$f":"SUM(D38:I38)","v":789},{"$f":"COUNTIF(D38:I38,\">0\")","v":6},{"$f":"J39","v":3049},131.5,6]
[null,null,null,{"$f":"SUM(D36:D38)","v":508},479,435,486,631,510,3049,{"$f":"COUNTIF(D39:I39,\">0\")*3","v":18},{"$f":"J39","v":3049},169.38888888888889,null,null,{"$f":"MAX(D15:I15)","v":686}]
[null,null,null,null,null,null,null,null,null,null,null,{"$f":"J39","v":3049}]
["Cod","Nombre del Jugador","FEDERACION","L1","L2","L3","L4","L5","L6","Serie",null,{"$f":"J45","v":3065},"Prom"]
["j28",{"$f":"VLOOKUP($A42,datos!$A$4:$AD$52,2)","v":"BASTIAN MALDONADO R."},{"$f":"VLOOKUP($A42,datos!$A$4:$AD$52,3)","v":"Chile"},{"$f":"VLOOKUP($A42,datos!$A$4:$AD$52,16)","v":182},{"$f":"VLOOKUP($A42,datos!$A$4:$AD$52,17)","v":162},{"$f":"VLOOKUP($A42,datos!$A$4:$AD$52,18)","v":222},{"$f":"VLOOKUP($A42,datos!$A$4:$AD$52,19)","v":234},{"$f":"VLOOKUP($A42,datos!$A$4:$AD$52,20)","v":182},{"$f":"VLOOKUP($A42,datos!$A$4:$AD$52,21)","v":187},{"$f":"SUM(D42:I42)","v":1169},{"$f":"COUNTIF(D42:I42,\">0\")","v":6},{"$f":"J45","v":3065},{"$f":"J42/K42","v":194.83333333333334},"dif"]
["j30",{"$f":"VLOOKUP($A43,datos!$A$4:$AD$52,2)","v":"IVAN VELIZ H."},{"$f":"VLOOKUP($A43,datos!$A$4:$AD$52,3)","v":"Chile"},{"$f":"VLOOKUP($A43,datos!$A$4:$AD$52,16)","v":131},{"$f":"VLOOKUP($A43,datos!$A$4:$AD$52,17)","v":153},{"$f":"VLOOKUP($A43,datos!$A$4:$AD$52,18)","v":110},{"$f":"VLOOKUP($A43,datos!$A$4:$AD$52,19)","v":177},{"$f":"VLOOKUP($A43,datos!$A$4:$AD$52,20)","v":145},{"$f":"VLOOKUP($A43,datos!$A$4:$AD$52,21)","v":142},{"$f":"SUM(D43:I43)","v":858},{"$f":"COUNTIF(D43:I43,\">0\")","v":6},{"$f":"J45","v":3065},143,{"$f":"MAX($J$51,$J$45,$J$27,$J$39,$J$21,$J$33,$J$9,$J$15)-J45","v":731}]
["j29",{"$f":"VLOOKUP($A44,datos!$A$4:$AD$52,2)","v":"MATIAS NAZAR G."},{"$f":"VLOOKUP($A44,datos!$A$4:$AD$52,3)","v":"Chile"},{"$f":"VLOOKUP($A44,datos!$A$4:$AD$52,16)","v":199},{"$f":"VLOOKUP($A44,datos!$A$4:$AD$52,17)","v":158},{"$f":"VLOOKUP($A44,datos!$A$4:$AD$52,18)","v":180},{"$f":"VLOOKUP($A44,datos!$A$4:$AD$52,19)","v":212},{"$f":"VLOOKUP($A44,datos!$A$4:$AD$52,20)","v":145},{"$f":"VLOOKUP($A44,datos!$A$4:$AD$52,21)","v":144},{"$f":"SUM(D44:I44)","v":1038},{"$f":"COUNTIF(D44:I44,\">0\")","v":6},{"$f":"J45","v":3065},173,7]
[null,null,null,{"$f":"SUM(D42:D44)","v":512},473,512,623,472,473,3065,{"$f":"COUNTIF(D45:I45,\">0\")*3","v":18},{"$f":"J45","v":3065},170.27777777777777]
[null,null,null,null,null,null,null,null,null,null,null,{"$f":"J45","v":3065}]
["Cod","Nombre del Jugador","FEDERACION","L1","L2","L3","L4","L5","L6","Serie",null,{"$f":"J51","v":2627},"Prom"]
["j38",{"$f":"VLOOKUP($A48,datos!$A$4:$AD$52,2)","v":"FELIPE FUENTES F."},{"$f":"VLOOKUP($A48,datos!$A$4:$AD$52,3)","v":"Uruguay"},{"$f":"VLOOKUP($A48,datos!$A$4:$AD$52,16)","v":146},{"$f":"VLOOKUP($A48,datos!$A$4:$AD$52,17)","v":130},{"$f":"VLOOKUP($A48,datos!$A$4:$AD$52,18)","v":108},{"$f":"VLOOKUP($A48,datos!$A$4:$AD$52,19)","v":154},{"$f":"VLOOKUP($A48,datos!$A$4:$AD$52,20)","v":142},{"$f":"VLOOKUP($A48,datos!$A$4:$AD$52,21)","v":194},{"$f":"SUM(D48:I48)","v":874},{"$f":"COUNTIF(D48:I48,\">0\")","v":6},{"$f":"J51","v":2627},{"$f":"J48/K48","v":145.66666666666666},"dif"]
["j36",{"$f":"VLOOKUP($A49,datos!$A$4:$AD$52,2)","v":"MATIAS DA MOTTA L."},{"$f":"VLOOKUP($A49,datos!$A$4:$AD$52,3)","v":"Uruguay"},{"$f":"VLOOKUP($A49,datos!$A$4:$AD$52,16)","v":147},{"$f":"VLOOKUP($A49,datos!$A$4:$AD$52,17)","v":157},{"$f":"VLOOKUP($A49,datos!$A$4:$AD$52,18)","v":144},{"$f":"VLOOKUP($A49,datos!$A$4:$AD$52,19)","v":137},{"$f":"VLOOKUP($A49,datos!$A$4:$AD$52,20)","v":195},{"$f":"VLOOKUP($A49,datos!$A$4:$AD$52,21)","v":137},{"$f":"SUM(D49:I49)","v":917},{"$f":"COUNTIF(D49:I49,\">0\")","v":6},{"$f":"J51","v":2627},152.83333333333334,{"$f":"MAX($J$51,$J$45,$J$27,$J$39,$J$21,$J$33,$J$9,$J$15)-J51","v":1169}]
["j37",{"$f":"VLOOKUP($A50,datos!$A$4:$AD$52,2)","v":"ALFONSO RODRIGUEZ L."},{"$f":"VLOOKUP($A50,datos!$A$4:$AD$52,3)","v":"Uruguay"},{"$f":"VLOOKUP($A50,datos!$A$4:$AD$52,16)","v":194},{"$f":"VLOOKUP($A50,datos!$A$4:$AD$52,17)","v":137},{"$f":"VLOOKUP($A50,datos!$A$4:$AD$52,18)","v":128},{"$f":"VLOOKUP($A50,datos!$A$4:$AD$52,19)","v":112},{"$f":"VLOOKUP($A50,datos!$A$4:$AD$52,20)","v":121},{"$f":"VLOOKUP($A50,datos!$A$4:$AD$52,21)","v":144},{"$f":"SUM(D50:I50)","v":836},{"$f":"COUNTIF(D50:I50,\">0\")","v":6},{"$f":"J51","v":2627},139.33333333333334,8]
[null,null,null,{"$f":"SUM(D48:D50)","v":487},424,380,403,458,475,2627,{"$f":"COUNTIF(D51:I51,\">0\")*3","v":18},{"$f":"J51","v":2627},145.94444444444446]
[null,null,null,null,null,null,null,null,null,null,null,{"$f":"J51","v":2627}]

{"sheet":"cuarteto","index":4,"n_rows":60,"n_cols":16,"rows_kept":60,"cut":false,"hidden":false,"merged":[[3,1,3,13],[1,0,1,13],[2,0,2,13],[50,13,51,13],[57,13,58,13],[15,13,16,13],[36,13,37,13],[43,13,44,13],[8,13,9,13],[29,13,30,13],[22,13,23,13]]}
[]
["CAMPEONATO SUDAMERICANO JUVENIL 2014"]
["EQUIPOS SUB 20"]
[null,"            SANTIAGO DE CHILE - DEL 12 AL 18 DE ABRIL DE 2014"]
["Cod","Nombre del Jugador","FEDERACION","L1","L2","L3","L4","L5","L6","Serie",{"$f":"J10","v":4631},null,"Prom"]
["j24",{"$f":"VLOOKUP($A6,datos!$A$4:$AD$52,2)","v":"CARLOS F. SAAVEDRA"},{"$f":"VLOOKUP($A6,datos!$A$4:$AD$52,3)","v":"Colombia"},{"$f":"VLOOKUP($A6,datos!$A$4:$AD$52,22)","v":164},{"$f":"VLOOKUP($A6,datos!$A$4:$AD$52,23)","v":167},{"$f":"VLOOKUP($A6,datos!$A$4:$AD$52,24)","v":233},{"$f":"VLOOKUP($A6,datos!$A$4:$AD$52,25)","v":185},{"$f":"VLOOKUP($A6,datos!$A$4:$AD$52,26)","v":173},{"$f":"VLOOKUP($A6,datos!$A$4:$AD$52,27)","v":213},{"$f":"SUM(D6:I6)","v":1135},{"$f":"J10","v":4631},{"$f":"(COUNTIF(D6:I6,\">0\"))","v":6},{"$f":"J6/L6","v":189.16666666666666}]
["j25",{"$f":"VLOOKUP($A7,datos!$A$4:$AD$52,2)","v":"SEBASTIAN DONADO"},{"$f":"VLOOKUP($A7,datos!$A$4:$AD$52,3)","v":"Colombia"},{"$f":"VLOOKUP($A7,datos!$A$4:$AD$52,22)","v":170},{"$f":"VLOOKUP($A7,datos!$A$4:$AD$52,23)","v":160},{"$f":"VLOOKUP($A7,datos!$A$4:$AD$52,24)","v":168},{"$f":"VLOOKUP($A7,datos!$A$4:$AD$52,25)","v":175},{"$f":"VLOOKUP($A7,datos!$A$4:$AD$52,26)","v":206},{"$f":"VLOOKUP($A7,datos!$A$4:$AD$52,27)","v":210},{"$f":"SUM(D7:I7)","v":1089},{"$f":"J10","v":4631},{"$f":"(COUNTIF(D7:I7,\">0\"))","v":6},{"$f":"J7/L7","v":181.5},"dif"]
["j26",{"$f":"VLOOKUP($A8,datos!$A$4:$AD$52,2)","v":"SEBASTIAN CHARRY"},{"$f":"VLOOKUP($A8,datos!$A$4:$AD$52,3)","v":"Colombia"},{"$f":"VLOOKUP($A8,datos!$A$4:$AD$52,22)","v":215},{"$f":"VLOOKUP($A8,datos!$A$4:$AD$52,23)","v":176},{"$f":"VLOOKUP($A8,datos!$A$4:$AD$52,24)","v":178},{"$f":"VLOOKUP($A8,datos!$A$4:$AD$52,25)","v":203},{"$f":"VLOOKUP($A8,datos!$A$4:$AD$52,26)","v":224},{"$f":"VLOOKUP($A8,datos!$A$4:$AD$52,27)","v":186},{"$f":"SUM(D8:I8)","v":1182},{"$f":"J10","v":4631},{"$f":"(COUNTIF(D8:I8,\">0\"))","v":6},{"$f":"J8/L8","v":197},{"$f":"MAX($J$45,$J$38,$J$31,$J$17,$J$10,$J$24,$J$52)-J10","v":0}]
["j27",{"$f":"VLOOKUP($A9,datos!$A$4:$AD$52,2)","v":"JORGE FIGUEROA"},{"$f":"VLOOKUP($A9,datos!$A$4:$AD$52,3)","v":"Colombia"},{"$f":"VLOOKUP($A9,datos!$A$4:$AD$52,22)","v":152},{"$f":"VLOOKUP($A9,datos!$A$4:$AD$52,23)","v":224},{"$f":"VLOOKUP($A9,datos!$A$4:$AD$52,24)","v":183},{"$f":"VLOOKUP($A9,datos!$A$4:$AD$52,25)","v":226},{"$f":"VLOOKUP($A9,datos!$A$4:$AD$52,26)","v":236},{"$f":"VLOOKUP($A9,datos!$A$4:$AD$52,27)","v":204},{"$f":"SUM(D9:I9)","v":1225},{"$f":"J10","v":4631},{"$f":"(COUNTIF(D9:I9,\">0\"))","v":6},{"$f":"J9/L9","v":204.16666666666666},"1°"]
[null,null,null,{"$f":"SUM(D6:D9)","v":701},727,762,789,839,813,4631,{"$f":"J10","v":4631},{"$f":"(COUNTIF(D10:I10,\">0\"))*6","v":36},{"$f":"J10/L10","v":128.63888888888889},null,null,{"$f":"MAX(D10:I10)","v":839}]
[null,null,null,null,null,null,null,null,null,null,{"$f":"J10","v":4631}]
["Cod","Nombre del Jugador","FEDERACION","L1","L2","L3","L4","L5","L6","Serie",{"$f":"J17","v":4572},null,"Prom"]
["j16",{"$f":"VLOOKUP($A13,datos!$A$4:$AD$52,2)","v":"BRIAN HELMEYER"},{"$f":"VLOOKUP($A13,datos!$A$4:$AD$52,3)","v":"Aruba"},{"$f":"VLOOKUP($A13,datos!$A$4:$AD$52,22)","v":185},{"$f":"VLOOKUP($A13,datos!$A$4:$AD$52,23)","v":233},{"$f":"VLOOKUP($A13,datos!$A$4:$AD$52,24)","v":188},{"$f":"VLOOKUP($A13,datos!$A$4:$AD$52,25)","v":185},{"$f":"VLOOKUP($A13,datos!$A$4:$AD$52,26)","v":203},{"$f":"VLOOKUP($A13,datos!$A$4:$AD$52,27)","v":188},{"$f":"SUM(D13:I13)","v":1182},{"$f":"J17","v":4572},{"$f":"(COUNTIF(D13:I13,\">0\"))","v":6},{"$f":"J13/L13","v":197}]
["j17",{"$f":"VLOOKUP($A14,datos!$A$4:$AD$52,2)","v":"YANNICK ROOS"},{"$f":"VLOOKUP($A14,datos!$A$4:$AD$52,3)","v":"Aruba"},{"$f":"VLOOKUP($A14,datos!$A$4:$AD$52,22)","v":178},{"$f":"VLOOKUP($A14,datos!$A$4:$AD$52,23)","v":195},{"$f":"VLOOKUP($A14,datos!$A$4:$AD$52,24)","v":172},{"$f":"VLOOKUP($A14,datos!$A$4:$AD$52,25)","v":212},{"$f":"VLOOKUP($A14,datos!$A$4:$AD$52,26)","v":212},{"$f":"VLOOKUP($A14,datos!$A$4:$AD$52,27)","v":192},{"$f":"SUM(D14:I14)","v":1161},{"$f":"J17","v":4572},{"$f":"(COUNTIF(D14:I14,\">0\"))","v":6},{"$f":"J14/L14","v":193.5},"dif"]
["j18",{"$f":"VLOOKUP($A15,datos!$A$4:$AD$52,2)","v":"OSMAR BISLIP"},{"$f":"VLOOKUP($A15,datos!$A$4:$AD$52,3)","v":"Aruba"},{"$f":"VLOOKUP($A15,datos!$A$4:$AD$52,22)","v":159},{"$f":"VLOOKUP($A15,datos!$A$4:$AD$52,23)","v":195},{"$f":"VLOOKUP($A15,datos!$A$4:$AD$52,24)","v":172},{"$f":"VLOOKUP($A15,datos!$A$4:$AD$52,25)","v":158},{"$f":"VLOOKUP($A15,datos!$A$4:$AD$52,26)","v":221},{"$f":"VLOOKUP($A15,datos!$A$4:$AD$52,27)","v":173},{"$f":"SUM(D15:I15)","v":1078},{"$f":"J17","v":4572},{"$f":"(COUNTIF(D15:I15,\">0\"))","v":6},{"$f":"J15/L15","v":179.66666666666666},{"$f":"MAX($J$45,$J$38,$J$31,$J$17,$J$10,$J$24,$J$52)-J17","v":59}]
["j19",{"$f":"VLOOKUP($A16,datos!$A$4:$AD$52,2)","v":"ELIAS HALABI"},{"$f":"VLOOKUP($A16,datos!$A$4:$AD$52,3)","v":"Aruba"},{"$f":"VLOOKUP($A16,datos!$A$4:$AD$52,22)","v":171},{"$f":"VLOOKUP($A16,datos!$A$4:$AD$52,23)","v":171},{"$f":"VLOOKUP($A16,datos!$A$4:$AD$52,24)","v":227},{"$f":"VLOOKUP($A16,datos!$A$4:$AD$52,25)","v":229},{"$f":"VLOOKUP($A16,datos!$A$4:$AD$52,26)","v":159},{"$f":"VLOOKUP($A16,datos!$A$4:$AD$52,27)","v":194},{"$f":"SUM(D16:I16)","v":1151},{"$f":"J17","v":4572},{"$f":"(COUNTIF(D16:I16,\">0\"))","v":6},{"$f":"J16/L16","v":191.83333333333334},"2°"]
[null,null,null,{"$f":"SUM(D13:D16)","v":693},794,759,784,795,747,4572,{"$f":"J17","v":4572},{"$f":"(COUNTIF(D17:I17,\">0\"))*6","v":36},{"$f":"J17/L17","v":127},null,null,{"$f":"MAX(D17:I17)","v":795}]
[null,null,null,null,null,null,null,null,null,null,{"$f":"J17","v":4572}]
["Cod","Nombre del Jugador","FEDERACION","L1","L2","L3","L4","L5","L6","Serie",{"$f":"J24","v":4520},null,"Prom"]
["j12",{"$f":"VLOOKUP($A20,datos!$A$4:$AD$52,2)","v":"AGUSTIN LEANDRO A."},{"$f":"VLOOKUP($A20,datos!$A$4:$AD$52,3)","v":"Argentina"},{"$f":"VLOOKUP($A20,datos!$A$4:$AD$52,22)","v":188},{"$f":"VLOOKUP($A20,datos!$A$4:$AD$52,23)","v":199},{"$f":"VLOOKUP($A20,datos!$A$4:$AD$52,24)","v":195},{"$f":"VLOOKUP($A20,datos!$A$4:$AD$52,25)","v":181},{"$f":"VLOOKUP($A20,datos!$A$4:$AD$52,26)","v":191},{"$f":"VLOOKUP($A20,datos!$A$4:$AD$52,27)","v":245},{"$f":"SUM(D20:I20)","v":1199},{"$f":"J24","v":4520},{"$f":"(COUNTIF(D20:I20,\">0\"))","v":6},{"$f":"J20/L20","v":199.83333333333334}]
["j13",{"$f":"VLOOKUP($A21,datos!$A$4:$AD$52,2)","v":"FRANCO R. GUALINI"},{"$f":"VLOOKUP($A21,datos!$A$4:$AD$52,3)","v":"Argentina"},{"$f":"VLOOKUP($A21,datos!$A$4:$AD$52,22)","v":178},{"$f":"VLOOKUP($A21,datos!$A$4:$AD$52,23)","v":234},{"$f":"VLOOKUP($A21,datos!$A$4:$AD$52,24)","v":156},{"$f":"VLOOKUP($A21,datos!$A$4:$AD$52,25)","v":226},{"$f":"VLOOKUP($A21,datos!$A$4:$AD$52,26)","v":162},{"$f":"VLOOKUP($A21,datos!$A$4:$AD$52,27)","v":155},{"$f":"SUM(D21:I21)","v":1111},{"$f":"J24","v":4520},{"$f":"(COUNTIF(D21:I21,\">0\"))","v":6},{"$f":"J21/L21","v":185.16666666666666},"dif"]
["j14",{"$f":"VLOOKUP($A22,datos!$A$4:$AD$52,2)","v":"FABRICIO E. SANDUAY"},{"$f":"VLOOKUP($A22,datos!$A$4:$AD$52,3)","v":"Argentina"},{"$f":"VLOOKUP($A22,datos!$A$4:$AD$52,22)","v":203},{"$f":"VLOOKUP($A22,datos!$A$4:$AD$52,23)","v":171},{"$f":"VLOOKUP($A22,datos!$A$4:$AD$52,24)","v":209},{"$f":"VLOOKUP($A22,datos!$A$4:$AD$52,25)","v":178},{"$f":"VLOOKUP($A22,datos!$A$4:$AD$52,26)","v":126},{"$f":"VLOOKUP($A22,datos!$A$4:$AD$52,27)","v":179},{"$f":"SUM(D22:I22)","v":1066},{"$f":"J24","v":4520},{"$f":"(COUNTIF(D22:I22,\">0\"))","v":6},{"$f":"J22/L22","v":177.66666666666666},{"$f":"MAX($J$45,$J$38,$J$31,$J$17,$J$10,$J$24,$J$52)-J24","v":111}]
["j15",{"$f":"VLOOKUP($A23,datos!$A$4:$AD$52,2)","v":"FERNANDO TAPIA M."},{"$f":"VLOOKUP($A23,datos!$A$4:$AD$52,3)","v":"Argentina"},{"$f":"VLOOKUP($A23,datos!$A$4:$AD$52,22)","v":251},{"$f":"VLOOKUP($A23,datos!$A$4:$AD$52,23)","v":171},{"$f":"VLOOKUP($A23,datos!$A$4:$AD$52,24)","v":184},{"$f":"VLOOKUP($A23,datos!$A$4:$AD$52,25)","v":192},{"$f":"VLOOKUP($A23,datos!$A$4:$AD$52,26)","v":165},{"$f":"VLOOKUP($A23,datos!$A$4:$AD$52,27)","v":181},{"$f":"SUM(D23:I23)","v":1144},{"$f":"J24","v":4520},{"$f":"(COUNTIF(D23:I23,\">0\"))","v":6},{"$f":"J23/L23","v":190.66666666666666},"3°"]
[null,null,null,{"$f":"SUM(D20:D23)","v":820},775,744,777,644,760,4520,{"$f":"J24","v":4520},{"$f":"(COUNTIF(D24:I24,\">0\"))*6","v":36},{"$f":"J24/L24","v":125.55555555555556},null,null,{"$f":"MAX(D24:I24)","v":820}]
[null,null,null,null,null,null,null,null,null,null,{"$f":"J24","v":4520}]
["Cod","Nombre del Jugador","FEDERACION","L1","L2","L3","L4","L5","L6","Serie",{"$f":"J31","v":4382},null,"Prom"]
["j20",{"$f":"VLOOKUP($A27,datos!$A$4:$AD$52,2)","v":"BRUNO COSTA S"},{"$f":"VLOOKUP($A27,datos!$A$4:$AD$52,3)","v":"Brasil"},{"$f":"VLOOKUP($A27,datos!$A$4:$AD$52,22)","v":221},{"$f":"VLOOKUP($A27,datos!$A$4:$AD$52,23)","v":190},{"$f":"VLOOKUP($A27,datos!$A$4:$AD$52,24)","v":222},{"$f":"VLOOKUP($A27,datos!$A$4:$AD$52,25)","v":162},{"$f":"VLOOKUP($A27,datos!$A$4:$AD$52,26)","v":172},{"$f":"VLOOKUP($A27,datos!$A$4:$AD$52,27)","v":203},{"$f":"SUM(D27:I27)","v":1170},{"$f":"J31","v":4382},{"$f":"(COUNTIF(D27:I27,\">0\"))","v":6},{"$f":"J27/L27","v":195}]
["j21",{"$f":"VLOOKUP($A28,datos!$A$4:$AD$52,2)","v":"BERNARDO ABREU"},{"$f":"VLOOKUP($A28,datos!$A$4:$AD$52,3)","v":"Brasil"},{"$f":"VLOOKUP($A28,datos!$A$4:$AD$52,22)","v":150},{"$f":"VLOOKUP($A28,datos!$A$4:$AD$52,23)","v":176},{"$f":"VLOOKUP($A28,datos!$A$4:$AD$52,24)","v":181},{"$f":"VLOOKUP($A28,datos!$A$4:$AD$52,25)","v":156},{"$f":"VLOOKUP($A28,datos!$A$4:$AD$52,26)","v":193},{"$f":"VLOOKUP($A28,datos!$A$4:$AD$52,27)","v":205},{"$f":"SUM(D28:I28)","v":1061},{"$f":"J31","v":4382},{"$f":"(COUNTIF(D28:I28,\">0\"))","v":6},{"$f":"J28/L28","v":176.83333333333334},"dif"]
["j22",{"$f":"VLOOKUP($A29,datos!$A$4:$AD$52,2)","v":"THIAGO FELICETTI"},{"$f":"VLOOKUP($A29,datos!$A$4:$AD$52,3)","v":"Brasil"},{"$f":"VLOOKUP($A29,datos!$A$4:$AD$52,22)","v":210},{"$f":"VLOOKUP($A29,datos!$A$4:$AD$52,23)","v":158},{"$f":"VLOOKUP($A29,datos!$A$4:$AD$52,24)","v":227},{"$f":"VLOOKUP($A29,datos!$A$4:$AD$52,25)","v":161},{"$f":"VLOOKUP($A29,datos!$A$4:$AD$52,26)","v":145},{"$f":"VLOOKUP($A29,datos!$A$4:$AD$52,27)","v":171},{"$f":"SUM(D29:I29)","v":1072},{"$f":"J31","v":4382},{"$f":"(COUNTIF(D29:I29,\">0\"))","v":6},{"$f":"J29/L29","v":178.66666666666666},{"$f":"MAX($J$45,$J$38,$J$31,$J$17,$J$10,$J$24,$J$52)-J31","v":249}]
["j23",{"$f":"VLOOKUP($A30,datos!$A$4:$AD$52,2)","v":"JOAO I. FERREIRA N. "},{"$f":"VLOOKUP($A30,datos!$A$4:$AD$52,3)","v":"Brasil"},{"$f":"VLOOKUP($A30,datos!$A$4:$AD$52,22)","v":148},{"$f":"VLOOKUP($A30,datos!$A$4:$AD$52,23)","v":212},{"$f":"VLOOKUP($A30,datos!$A$4:$AD$52,24)","v":143},{"$f":"VLOOKUP($A30,datos!$A$4:$AD$52,25)","v":190},{"$f":"VLOOKUP($A30,datos!$A$4:$AD$52,26)","v":194},{"$f":"VLOOKUP($A30,datos!$A$4:$AD$52,27)","v":192},{"$f":"SUM(D30:I30)","v":1079},{"$f":"J31","v":4382},{"$f":"(COUNTIF(D30:I30,\">0\"))","v":6},{"$f":"J30/L30","v":179.83333333333334},"4°"]
[null,null,null,{"$f":"SUM(D27:D30)","v":729},736,773,669,704,771,4382,{"$f":"J31","v":4382},{"$f":"(COUNTIF(D31:I31,\">0\"))*6","v":36},{"$f":"J31/L31","v":121.72222222222223},null,null,{"$f":"MAX(D31:I31)","v":773}]
[null,null,null,null,null,null,null,null,null,null,{"$f":"J31","v":4382}]
["Cod","Nombre del Jugador","FEDERACION","L1","L2","L3","L4","L5","L6","Serie",{"$f":"J38","v":4336},null,"Prom"]
["j32",{"$f":"VLOOKUP($A34,datos!$A$4:$AD$52,2)","v":"ADRIAN GUIBU K."},{"$f":"VLOOKUP($A34,datos!$A$4:$AD$52,3)","v":"Perú"},{"$f":"VLOOKUP($A34,datos!$A$4:$AD$52,22)","v":156},{"$f":"VLOOKUP($A34,datos!$A$4:$AD$52,23)","v":158},{"$f":"VLOOKUP($A34,datos!$A$4:$AD$52,24)","v":222},{"$f":"VLOOKUP($A34,datos!$A$4:$AD$52,25)","v":222},{"$f":"VLOOKUP($A34,datos!$A$4:$AD$52,26)","v":195},{"$f":"VLOOKUP($A34,datos!$A$4:$AD$52,27)","v":191},{"$f":"SUM(D34:I34)","v":1144},{"$f":"J38","v":4336},{"$f":"(COUNTIF(D34:I34,\">0\"))","v":6},{"$f":"J34/L34","v":190.66666666666666},null,null,{"$f":"MAX(P5:P32)","v":839}]
["j33",{"$f":"VLOOKUP($A35,datos!$A$4:$AD$52,2)","v":"JUAN ANDRES YUZURIHA"},{"$f":"VLOOKUP($A35,datos!$A$4:$AD$52,3)","v":"Perú"},{"$f":"VLOOKUP($A35,datos!$A$4:$AD$52,22)","v":186},{"$f":"VLOOKUP($A35,datos!$A$4:$AD$52,23)","v":187},{"$f":"VLOOKUP($A35,datos!$A$4:$AD$52,24)","v":222},{"$f":"VLOOKUP($A35,datos!$A$4:$AD$52,25)","v":211},{"$f":"VLOOKUP($A35,datos!$A$4:$AD$52,26)","v":234},{"$f":"VLOOKUP($A35,datos!$A$4:$AD$52,27)","v":171},{"$f":"SUM(D35:I35)","v":1211},{"$f":"J38","v":4336},{"$f":"(COUNTIF(D35:I35,\">0\"))","v":6},{"$f":"J35/L35","v":201.83333333333334},"dif"]
["j34",{"$f":"VLOOKUP($A36,datos!$A$4:$AD$52,2)","v":"KEIJI M. CAJACHACAHUA M."},{"$f":"VLOOKUP($A36,datos!$A$4:$AD$52,3)","v":"Perú"},{"$f":"VLOOKUP($A36,datos!$A$4:$AD$52,22)","v":134},{"$f":"VLOOKUP($A36,datos!$A$4:$AD$52,23)","v":138},{"$f":"VLOOKUP($A36,datos!$A$4:$AD$52,24)","v":134},{"$f":"VLOOKUP($A36,datos!$A$4:$AD$52,25)","v":139},{"$f":"VLOOKUP($A36,datos!$A$4:$AD$52,26)","v":135},{"$f":"VLOOKUP($A36,datos!$A$4:$AD$52,27)","v":200},{"$f":"SUM(D36:I36)","v":880},{"$f":"J38","v":4336},{"$f":"(COUNTIF(D36:I36,\">0\"))","v":6},{"$f":"J36/L36","v":146.66666666666666},{"$f":"MAX($J$45,$J$38,$J$31,$J$17,$J$10,$J$24,$J$52)-J38","v":295}]
["j35",{"$f":"VLOOKUP($A37,datos!$A$4:$AD$52,2)","v":"RENZO GUIBU K."},{"$f":"VLOOKUP($A37,datos!$A$4:$AD$52,3)","v":"Perú"},{"$f":"VLOOKUP($A37,datos!$A$4:$AD$52,22)","v":233},{"$f":"VLOOKUP($A37,datos!$A$4:$AD$52,23)","v":168},{"$f":"VLOOKUP($A37,datos!$A$4:$AD$52,24)","v":200},{"$f":"VLOOKUP($A37,datos!$A$4:$AD$52,25)","v":179},{"$f":"VLOOKUP($A37,datos!$A$4:$AD$52,26)","v":154},{"$f":"VLOOKUP($A37,datos!$A$4:$AD$52,27)","v":167},{"$f":"SUM(D37:I37)","v":1101},{"$f":"J38","v":4336},{"$f":"(COUNTIF(D37:I37,\">0\"))","v":6},{"$f":"J37/L37","v":183.5},"5°"]
[null,null,null,{"$f":"SUM(D34:D37)","v":709},651,778,751,718,729,4336,{"$f":"J38","v":4336},{"$f":"(COUNTIF(D38:I38,\">0\"))*6","v":36},{"$f":"J38/L38","v":120.44444444444444},null,null,{"$f":"MAX(D38:I38)","v":778}]
[null,null,null,null,null,null,null,null,null,null,{"$f":"J38","v":4336}]
["Cod","Nombre del Jugador","FEDERACION","L1","L2","L3","L4","L5","L6","Serie",{"$f":"J45","v":3776},null,"Prom"]
["j28",{"$f":"VLOOKUP($A41,datos!$A$4:$AD$52,2)","v":"BASTIAN MALDONADO R."},{"$f":"VLOOKUP($A41,datos!$A$4:$AD$52,3)","v":"Chile"},{"$f":"VLOOKUP($A41,datos!$A$4:$AD$52,22)","v":148},{"$f":"VLOOKUP($A41,datos!$A$4:$AD$52,23)","v":167},{"$f":"VLOOKUP($A41,datos!$A$4:$AD$52,24)","v":205},{"$f":"VLOOKUP($A41,datos!$A$4:$AD$52,25)","v":200},{"$f":"VLOOKUP($A41,datos!$A$4:$AD$52,26)","v":209},{"$f":"VLOOKUP($A41,datos!$A$4:$AD$52,27)","v":161},{"$f":"SUM(D41:I41)","v":1090},{"$f":"J45","v":3776},{"$f":"(COUNTIF(D41:I41,\">0\"))","v":6},{"$f":"J41/L41","v":181.66666666666666}]
["j29",{"$f":"VLOOKUP($A42,datos!$A$4:$AD$52,2)","v":"MATIAS NAZAR G."},{"$f":"VLOOKUP($A42,datos!$A$4:$AD$52,3)","v":"Chile"},{"$f":"VLOOKUP($A42,datos!$A$4:$AD$52,22)","v":156},{"$f":"VLOOKUP($A42,datos!$A$4:$AD$52,23)","v":160},{"$f":"VLOOKUP($A42,datos!$A$4:$AD$52,24)","v":160},{"$f":"VLOOKUP($A42,datos!$A$4:$AD$52,25)","v":185},{"$f":"VLOOKUP($A42,datos!$A$4:$AD$52,26)","v":167},{"$f":"VLOOKUP($A42,datos!$A$4:$AD$52,27)","v":162},{"$f":"SUM(D42:I42)","v":990},{"$f":"J45","v":3776},{"$f":"(COUNTIF(D42:I42,\">0\"))","v":6},{"$f":"J42/L42","v":165},"dif"]
["j30",{"$f":"VLOOKUP($A43,datos!$A$4:$AD$52,2)","v":"IVAN VELIZ H."},{"$f":"VLOOKUP($A43,datos!$A$4:$AD$52,3)","v":"Chile"},{"$f":"VLOOKUP($A43,datos!$A$4:$AD$52,22)","v":150},{"$f":"VLOOKUP($A43,datos!$A$4:$AD$52,23)","v":163},{"$f":"VLOOKUP($A43,datos!$A$4:$AD$52,24)","v":144},{"$f":"VLOOKUP($A43,datos!$A$4:$AD$52,25)","v":168},{"$f":"VLOOKUP($A43,datos!$A$4:$AD$52,26)","v":155},{"$f":"VLOOKUP($A43,datos!$A$4:$AD$52,27)","v":95},{"$f":"SUM(D43:I43)","v":875},{"$f":"J45","v":3776},{"$f":"(COUNTIF(D43:I43,\">0\"))","v":6},{"$f":"J43/L43","v":145.83333333333334},{"$f":"MAX($J$45,$J$38,$J$31,$J$17,$J$10,$J$24,$J$52)-J45","v":855}]
["j31",{"$f":"VLOOKUP($A44,datos!$A$4:$AD$52,2)","v":"LUIS JEREZ G."},{"$f":"VLOOKUP($A44,datos!$A$4:$AD$52,3)","v":"Chile"},{"$f":"VLOOKUP($A44,datos!$A$4:$AD$52,22)","v":157},{"$f":"VLOOKUP($A44,datos!$A$4:$AD$52,23)","v":124},{"$f":"VLOOKUP($A44,datos!$A$4:$AD$52,24)","v":166},{"$f":"VLOOKUP($A44,datos!$A$4:$AD$52,25)","v":125},{"$f":"VLOOKUP($A44,datos!$A$4:$AD$52,26)","v":123},{"$f":"VLOOKUP($A44,datos!$A$4:$AD$52,27)","v":126},{"$f":"SUM(D44:I44)","v":821},{"$f":"J45","v":3776},{"$f":"(COUNTIF(D44:I44,\">0\"))","v":6},{"$f":"J44/L44","v":136.83333333333334},"6°"]
[null,null,null,{"$f":"SUM(D41:D44)","v":611},614,675,678,654,544,3776,{"$f":"J45","v":3776},{"$f":"(COUNTIF(D45:I45,\">0\"))*6","v":36},{"$f":"J45/L45","v":104.88888888888889},null,null,{"$f":"MAX(D45:I45)","v":678}]
[null,null,null,null,null,null,null,null,null,null,{"$f":"J45","v":3776}]
["Cod","Nombre del Jugador","FEDERACION","L1","L2","L3","L4","L5","L6","Serie",{"$f":"J52","v":2786},null,"Prom"]
["j36",{"$f":"VLOOKUP($A48,datos!$A$4:$AD$52,2)","v":"MATIAS DA MOTTA L."},{"$f":"VLOOKUP($A48,datos!$A$4:$AD$52,3)","v":"Uruguay"},{"$f":"VLOOKUP($A48,datos!$A$4:$AD$52,22)","v":174},{"$f":"VLOOKUP($A48,datos!$A$4:$AD$52,23)","v":205},{"$f":"VLOOKUP($A48,datos!$A$4:$AD$52,24)","v":111},{"$f":"VLOOKUP($A48,datos!$A$4:$AD$52,25)","v":125},{"$f":"VLOOKUP($A48,datos!$A$4:$AD$52,26)","v":146},{"$f":"VLOOKUP($A48,datos!$A$4:$AD$52,27)","v":139},{"$f":"SUM(D48:I48)","v":900},{"$f":"J52","v":2786},{"$f":"(COUNTIF(D48:I48,\">0\"))","v":6},{"$f":"J48/L48","v":150}]
["j37",{"$f":"VLOOKUP($A49,datos!$A$4:$AD$52,2)","v":"ALFONSO RODRIGUEZ L."},{"$f":"VLOOKUP($A49,datos!$A$4:$AD$52,3)","v":"Uruguay"},{"$f":"VLOOKUP($A49,datos!$A$4:$AD$52,22)","v":139},{"$f":"VLOOKUP($A49,datos!$A$4:$AD$52,23)","v":156},{"$f":"VLOOKUP($A49,datos!$A$4:$AD$52,24)","v":130},{"$f":"VLOOKUP($A49,datos!$A$4:$AD$52,25)","v":151},{"$f":"VLOOKUP($A49,datos!$A$4:$AD$52,26)","v":131},{"$f":"VLOOKUP($A49,datos!$A$4:$AD$52,27)","v":167},{"$f":"SUM(D49:I49)","v":874},{"$f":"J52","v":2786},{"$f":"(COUNTIF(D49:I49,\">0\"))","v":6},{"$f":"J49/L49","v":145.66666666666666}]
["j38",{"$f":"VLOOKUP($A50,datos!$A$4:$AD$52,2)","v":"FELIPE FUENTES F."},{"$f":"VLOOKUP($A50,datos!$A$4:$AD$52,3)","v":"Uruguay"},{"$f":"VLOOKUP($A50,datos!$A$4:$AD$52,22)","v":157},{"$f":"VLOOKUP($A50,datos!$A$4:$AD$52,23)","v":184},{"$f":"VLOOKUP($A50,datos!$A$4:$AD$52,24)","v":211},{"$f":"VLOOKUP($A50,datos!$A$4:$AD$52,25)","v":131},{"$f":"VLOOKUP($A50,datos!$A$4:$AD$52,26)","v":168},{"$f":"VLOOKUP($A50,datos!$A$4:$AD$52,27)","v":161},{"$f":"SUM(D50:I50)","v":1012},{"$f":"J52","v":2786},{"$f":"(COUNTIF(D50:I50,\">0\"))","v":6},{"$f":"J50/L50","v":168.66666666666666}]
[null,null,null,null,null,null,null,null,null,null,2349]
[null,null,null,{"$f":"SUM(D48:D51)","v":470},545,452,407,445,467,2786,{"$f":"J52","v":2786},{"$f":"(COUNTIF(D52:I52,\">0\"))*6","v":36},{"$f":"J52/L52","v":77.388888888888886},null,null,{"$f":"MAX(D52:I52)","v":545}]
[null,null,null,null,null,null,null,null,null,null,{"$f":"J52","v":2786}]
["Cod","Nombre del Jugador","FEDERACION","L1","L2","L3","L4","L5","L6","Serie",{"$f":"J59","v":{"$error":"#N/A"}},null,"Prom"]
[null,{"$f":"VLOOKUP($A55,datos!$A$4:$AD$52,2)","v":{"$error":"#N/A"}},{"$f":"VLOOKUP($A55,datos!$A$4:$AD$52,3)","v":{"$error":"#N/A"}},{"$f":"VLOOKUP($A55,datos!$A$4:$AD$52,22)","v":{"$error":"#N/A"}},{"$f":"VLOOKUP($A55,datos!$A$4:$AD$52,23)","v":{"$error":"#N/A"}},{"$f":"VLOOKUP($A55,datos!$A$4:$AD$52,24)","v":{"$error":"#N/A"}},{"$f":"VLOOKUP($A55,datos!$A$4:$AD$52,25)","v":{"$error":"#N/A"}},{"$f":"VLOOKUP($A55,datos!$A$4:$AD$52,26)","v":{"$error":"#N/A"}},{"$f":"VLOOKUP($A55,datos!$A$4:$AD$52,27)","v":{"$error":"#N/A"}},{"$f":"SUM(D55:I55)","v":{"$error":"#N/A"}},{"$f":"J59","v":{"$error":"#N/A"}},{"$f":"(COUNTIF(D55:I55,\">0\"))","v":0},{"$f":"J55/L55","v":{"$error":"#N/A"}}]
[null,{"$f":"VLOOKUP($A56,datos!$A$4:$AD$52,2)","v":{"$error":"#N/A"}},{"$f":"VLOOKUP($A56,datos!$A$4:$AD$52,3)","v":{"$error":"#N/A"}},{"$f":"VLOOKUP($A56,datos!$A$4:$AD$52,22)","v":{"$error":"#N/A"}},{"$f":"VLOOKUP($A56,datos!$A$4:$AD$52,23)","v":{"$error":"#N/A"}},{"$f":"VLOOKUP($A56,datos!$A$4:$AD$52,24)","v":{"$error":"#N/A"}},{"$f":"VLOOKUP($A56,datos!$A$4:$AD$52,25)","v":{"$error":"#N/A"}},{"$f":"VLOOKUP($A56,datos!$A$4:$AD$52,26)","v":{"$error":"#N/A"}},{"$f":"VLOOKUP($A56,datos!$A$4:$AD$52,27)","v":{"$error":"#N/A"}},{"$f":"SUM(D56:I56)","v":{"$error":"#N/A"}},{"$f":"J59","v":{"$error":"#N/A"}},{"$f":"(COUNTIF(D56:I56,\">0\"))","v":0},{"$f":"J56/L56","v":{"$error":"#N/A"}}]
[null,{"$f":"VLOOKUP($A57,datos!$A$4:$AD$52,2)","v":{"$error":"#N/A"}},{"$f":"VLOOKUP($A57,datos!$A$4:$AD$52,3)","v":{"$error":"#N/A"}},{"$f":"VLOOKUP($A57,datos!$A$4:$AD$52,22)","v":{"$error":"#N/A"}},{"$f":"VLOOKUP($A57,datos!$A$4:$AD$52,23)","v":{"$error":"#N/A"}},{"$f":"VLOOKUP($A57,datos!$A$4:$AD$52,24)","v":{"$error":"#N/A"}},{"$f":"VLOOKUP($A57,datos!$A$4:$AD$52,25)","v":{"$error":"#N/A"}},{"$f":"VLOOKUP($A57,datos!$A$4:$AD$52,26)","v":{"$error":"#N/A"}},{"$f":"VLOOKUP($A57,datos!$A$4:$AD$52,27)","v":{"$error":"#N/A"}},{"$f":"SUM(D57:I57)","v":{"$error":"#N/A"}},{"$f":"J59","v":{"$error":"#N/A"}},{"$f":"(COUNTIF(D57:I57,\">0\"))","v":0},{"$f":"J57/L57","v":{"$error":"#N/A"}}]
[null,{"$f":"VLOOKUP($A58,datos!$A$4:$AD$52,2)","v":{"$error":"#N/A"}},{"$f":"VLOOKUP($A58,datos!$A$4:$AD$52,3)","v":{"$error":"#N/A"}},{"$f":"VLOOKUP($A58,datos!$A$4:$AD$52,22)","v":{"$error":"#N/A"}},{"$f":"VLOOKUP($A58,datos!$A$4:$AD$52,23)","v":{"$error":"#N/A"}},{"$f":"VLOOKUP($A58,datos!$A$4:$AD$52,24)","v":{"$error":"#N/A"}},{"$f":"VLOOKUP($A58,datos!$A$4:$AD$52,25)","v":{"$error":"#N/A"}},{"$f":"VLOOKUP($A58,datos!$A$4:$AD$52,26)","v":{"$error":"#N/A"}},{"$f":"VLOOKUP($A58,datos!$A$4:$AD$52,27)","v":{"$error":"#N/A"}},{"$f":"SUM(D58:I58)","v":{"$error":"#N/A"}},{"$f":"J59","v":{"$error":"#N/A"}},{"$f":"(COUNTIF(D58:I58,\">0\"))","v":0},{"$f":"J58/L58","v":{"$error":"#N/A"}}]
[null,null,null,{"$f":"SUM(D55:D58)","v":{"$error":"#N/A"}},{"$error":"#N/A"},{"$error":"#N/A"},{"$error":"#N/A"},{"$error":"#N/A"},{"$error":"#N/A"},{"$error":"#N/A"},{"$f":"J59","v":{"$error":"#N/A"}},{"$f":"(COUNTIF(D59:I59,\">0\"))*6","v":0},{"$f":"J59/L59","v":{"$error":"#N/A"}},null,null,{"$f":"MAX(D59:I59)","v":{"$error":"#N/A"}}]
[null,null,null,null,null,null,null,null,null,null,{"$f":"J59","v":{"$error":"#N/A"}}]

{"sheet":"T EVENTO","index":5,"n_rows":55,"n_cols":36,"rows_kept":55,"cut":false,"hidden":false,"merged":[[4,3,4,9],[4,10,4,16],[4,24,4,30],[4,17,4,23],[1,0,1,34],[2,0,2,34],[3,0,3,34]]}
[]
["CAMPEONATO SUDAMERICANO JUVENIL 2014"]
["TODO EVENTO INDIVIDUAL"]
["SANTIAGO DE CHILE - DEL 12 AL 18 DE ABRIL DE 2014"]
[null,null,null,"INDIVIDUAL",null,null,null,null,null,null,"PAREJAS",null,null,null,null,null,null,"TERCETOS",null,null,null,null,null,null,"CUARTETOS"]
["Cod","Nombre del Jugador","FEDERACION","L1","L2","L3","L4","L5","L6","Serie","L7","L8","L9","L10","L11","L12","Serie","L13","L14","L15","L16","L17","L18","Serie","L19","L20","L21","L22","L23","L24","Serie","L","Total","Prom","Pos.","dif"]
["J20",{"$f":"VLOOKUP($A7,datos!$A$4:$AD$52,2)","v":"BRUNO COSTA S"},{"$f":"VLOOKUP($A7,datos!$A$4:$AD$52,3)","v":"Brasil"},{"$f":"VLOOKUP($A7,datos!$A$4:$AD$52,4)","v":202},{"$f":"VLOOKUP($A7,datos!$A$4:$AD$52,5)","v":265},{"$f":"VLOOKUP($A7,datos!$A$4:$AD$52,6)","v":214},{"$f":"VLOOKUP($A7,datos!$A$4:$AD$52,7)","v":185},{"$f":"VLOOKUP($A7,datos!$A$4:$AD$52,8)","v":211},{"$f":"VLOOKUP($A7,datos!$A$4:$AD$52,9)","v":233},{"$f":"SUM(D7:I7)","v":1310},{"$f":"VLOOKUP($A7,datos!$A$4:$AD$52,10)","v":178},{"$f":"VLOOKUP($A7,datos!$A$4:$AD$52,11)","v":200},{"$f":"VLOOKUP($A7,datos!$A$4:$AD$52,12)","v":213},{"$f":"VLOOKUP($A7,datos!$A$4:$AD$52,13)","v":210},{"$f":"VLOOKUP($A7,datos!$A$4:$AD$52,14)","v":202},{"$f":"VLOOKUP($A7,datos!$A$4:$AD$52,15)","v":247},{"$f":"SUM(K7:P7)","v":1250},{"$f":"VLOOKUP($A7,datos!$A$4:$AD$52,16)","v":182},{"$f":"VLOOKUP($A7,datos!$A$4:$AD$52,17)","v":277},{"$f":"VLOOKUP($A7,datos!$A$4:$AD$52,18)","v":225},{"$f":"VLOOKUP($A7,datos!$A$4:$AD$52,19)","v":254},{"$f":"VLOOKUP($A7,datos!$A$4:$AD$52,20)","v":267},{"$f":"VLOOKUP($A7,datos!$A$4:$AD$52,21)","v":213},{"$f":"SUM(R7:W7)","v":1418},{"$f":"VLOOKUP($A7,datos!$A$4:$AD$52,22)","v":221},{"$f":"VLOOKUP($A7,datos!$A$4:$AD$52,23)","v":190},{"$f":"VLOOKUP($A7,datos!$A$4:$AD$52,24)","v":222},{"$f":"VLOOKUP($A7,datos!$A$4:$AD$52,25)","v":162},{"$f":"VLOOKUP($A7,datos!$A$4:$AD$52,26)","v":172},{"$f":"VLOOKUP($A7,datos!$A$4:$AD$52,27)","v":203},{"$f":"SUM(Y7:AD7)","v":1170},{"$f":"VLOOKUP($A7,datos!$A$4:$AD$52,28)","v":24},{"$f":"VLOOKUP($A7,datos!$A$4:$AD$52,29)","v":5148},{"$f":"AG7/AF7","v":214.5},"1º",{"$f":"MAX($AG$7:$AG$51)-AG7","v":{"$error":"#N/A"}}]
["J27",{"$f":"VLOOKUP($A8,datos!$A$4:$AD$52,2)","v":"JORGE FIGUEROA"},{"$f":"VLOOKUP($A8,datos!$A$4:$AD$52,3)","v":"Colombia"},{"$f":"VLOOKUP($A8,datos!$A$4:$AD$52,4)","v":216},{"$f":"VLOOKUP($A8,datos!$A$4:$AD$52,5)","v":214},{"$f":"VLOOKUP($A8,datos!$A$4:$AD$52,6)","v":224},{"$f":"VLOOKUP($A8,datos!$A$4:$AD$52,7)","v":233},{"$f":"VLOOKUP($A8,datos!$A$4:$AD$52,8)","v":169},{"$f":"VLOOKUP($A8,datos!$A$4:$AD$52,9)","v":207},1263,{"$f":"VLOOKUP($A8,datos!$A$4:$AD$52,10)","v":242},{"$f":"VLOOKUP($A8,datos!$A$4:$AD$52,11)","v":148},{"$f":"VLOOKUP($A8,datos!$A$4:$AD$52,12)","v":216},{"$f":"VLOOKUP($A8,datos!$A$4:$AD$52,13)","v":212},{"$f":"VLOOKUP($A8,datos!$A$4:$AD$52,14)","v":184},{"$f":"VLOOKUP($A8,datos!$A$4:$AD$52,15)","v":175},1177,{"$f":"VLOOKUP($A8,datos!$A$4:$AD$52,16)","v":219},{"$f":"VLOOKUP($A8,datos!$A$4:$AD$52,17)","v":175},{"$f":"VLOOKUP($A8,datos!$A$4:$AD$52,18)","v":223},{"$f":"VLOOKUP($A8,datos!$A$4:$AD$52,19)","v":243},{"$f":"VLOOKUP($A8,datos!$A$4:$AD$52,20)","v":214},{"$f":"VLOOKUP($A8,datos!$A$4:$AD$52,21)","v":182},1256,{"$f":"VLOOKUP($A8,datos!$A$4:$AD$52,22)","v":152},{"$f":"VLOOKUP($A8,datos!$A$4:$AD$52,23)","v":224},{"$f":"VLOOKUP($A8,datos!$A$4:$AD$52,24)","v":183},{"$f":"VLOOKUP($A8,datos!$A$4:$AD$52,25)","v":226},{"$f":"VLOOKUP($A8,datos!$A$4:$AD$52,26)","v":236},{"$f":"VLOOKUP($A8,datos!$A$4:$AD$52,27)","v":204},1225,{"$f":"VLOOKUP($A8,datos!$A$4:$AD$52,28)","v":24},{"$f":"VLOOKUP($A8,datos!$A$4:$AD$52,29)","v":4921},205.04166666666666,"2º",{"$error":"#N/A"}]
["J26",{"$f":"VLOOKUP($A9,datos!$A$4:$AD$52,2)","v":"SEBASTIAN CHARRY"},{"$f":"VLOOKUP($A9,datos!$A$4:$AD$52,3)","v":"Colombia"},{"$f":"VLOOKUP($A9,datos!$A$4:$AD$52,4)","v":223},{"$f":"VLOOKUP($A9,datos!$A$4:$AD$52,5)","v":223},{"$f":"VLOOKUP($A9,datos!$A$4:$AD$52,6)","v":162},{"$f":"VLOOKUP($A9,datos!$A$4:$AD$52,7)","v":246},{"$f":"VLOOKUP($A9,datos!$A$4:$AD$52,8)","v":227},{"$f":"VLOOKUP($A9,datos!$A$4:$AD$52,9)","v":257},1338,{"$f":"VLOOKUP($A9,datos!$A$4:$AD$52,10)","v":225},{"$f":"VLOOKUP($A9,datos!$A$4:$AD$52,11)","v":199},{"$f":"VLOOKUP($A9,datos!$A$4:$AD$52,12)","v":174},{"$f":"VLOOKUP($A9,datos!$A$4:$AD$52,13)","v":169},{"$f":"VLOOKUP($A9,datos!$A$4:$AD$52,14)","v":191},{"$f":"VLOOKUP($A9,datos!$A$4:$AD$52,15)","v":195},1153,{"$f":"VLOOKUP($A9,datos!$A$4:$AD$52,16)","v":168},{"$f":"VLOOKUP($A9,datos!$A$4:$AD$52,17)","v":239},{"$f":"VLOOKUP($A9,datos!$A$4:$AD$52,18)","v":211},{"$f":"VLOOKUP($A9,datos!$A$4:$AD$52,19)","v":216},{"$f":"VLOOKUP($A9,datos!$A$4:$AD$52,20)","v":198},{"$f":"VLOOKUP($A9,datos!$A$4:$AD$52,21)","v":193},1225,{"$f":"VLOOKUP($A9,datos!$A$4:$AD$52,22)","v":215},{"$f":"VLOOKUP($A9,datos!$A$4:$AD$52,23)","v":176},{"$f":"VLOOKUP($A9,datos!$A$4:$AD$52,24)","v":178},{"$f":"VLOOKUP($A9,datos!$A$4:$AD$52,25)","v":203},{"$f":"VLOOKUP($A9,datos!$A$4:$AD$52,26)","v":224},{"$f":"VLOOKUP($A9,datos!$A$4:$AD$52,27)","v":186},1182,{"$f":"VLOOKUP($A9,datos!$A$4:$AD$52,28)","v":24},{"$f":"VLOOKUP($A9,datos!$A$4:$AD$52,29)","v":4898},204.08333333333334,"3º",{"$error":"#N/A"}]
["J16",{"$f":"VLOOKUP($A10,datos!$A$4:$AD$52,2)","v":"BRIAN HELMEYER"},{"$f":"VLOOKUP($A10,datos!$A$4:$AD$52,3)","v":"Aruba"},{"$f":"VLOOKUP($A10,datos!$A$4:$AD$52,4)","v":176},{"$f":"VLOOKUP($A10,datos!$A$4:$AD$52,5)","v":217},{"$f":"VLOOKUP($A10,datos!$A$4:$AD$52,6)","v":155},{"$f":"VLOOKUP($A10,datos!$A$4:$AD$52,7)","v":238},{"$f":"VLOOKUP($A10,datos!$A$4:$AD$52,8)","v":174},{"$f":"VLOOKUP($A10,datos!$A$4:$AD$52,9)","v":192},1152,{"$f":"VLOOKUP($A10,datos!$A$4:$AD$52,10)","v":177},{"$f":"VLOOKUP($A10,datos!$A$4:$AD$52,11)","v":172},{"$f":"VLOOKUP($A10,datos!$A$4:$AD$52,12)","v":193},{"$f":"VLOOKUP($A10,datos!$A$4:$AD$52,13)","v":200},{"$f":"VLOOKUP($A10,datos!$A$4:$AD$52,14)","v":235},{"$f":"VLOOKUP($A10,datos!$A$4:$AD$52,15)","v":184},1161,{"$f":"VLOOKUP($A10,datos!$A$4:$AD$52,16)","v":227},{"$f":"VLOOKUP($A10,datos!$A$4:$AD$52,17)","v":245},{"$f":"VLOOKUP($A10,datos!$A$4:$AD$52,18)","v":187},{"$f":"VLOOKUP($A10,datos!$A$4:$AD$52,19)","v":197},{"$f":"VLOOKUP($A10,datos!$A$4:$AD$52,20)","v":211},{"$f":"VLOOKUP($A10,datos!$A$4:$AD$52,21)","v":167},1234,{"$f":"VLOOKUP($A10,datos!$A$4:$AD$52,22)","v":185},{"$f":"VLOOKUP($A10,datos!$A$4:$AD$52,23)","v":233},{"$f":"VLOOKUP($A10,datos!$A$4:$AD$52,24)","v":188},{"$f":"VLOOKUP($A10,datos!$A$4:$AD$52,25)","v":185},{"$f":"VLOOKUP($A10,datos!$A$4:$AD$52,26)","v":203},{"$f":"VLOOKUP($A10,datos!$A$4:$AD$52,27)","v":188},1182,{"$f":"VLOOKUP($A10,datos!$A$4:$AD$52,28)","v":24},{"$f":"VLOOKUP($A10,datos!$A$4:$AD$52,29)","v":4729},197.04166666666666,"4º",{"$error":"#N/A"}]
["J24",{"$f":"VLOOKUP($A11,datos!$A$4:$AD$52,2)","v":"CARLOS F. SAAVEDRA"},{"$f":"VLOOKUP($A11,datos!$A$4:$AD$52,3)","v":"Colombia"},{"$f":"VLOOKUP($A11,datos!$A$4:$AD$52,4)","v":192},{"$f":"VLOOKUP($A11,datos!$A$4:$AD$52,5)","v":233},{"$f":"VLOOKUP($A11,datos!$A$4:$AD$52,6)","v":245},{"$f":"VLOOKUP($A11,datos!$A$4:$AD$52,7)","v":199},{"$f":"VLOOKUP($A11,datos!$A$4:$AD$52,8)","v":244},{"$f":"VLOOKUP($A11,datos!$A$4:$AD$52,9)","v":193},1306,{"$f":"VLOOKUP($A11,datos!$A$4:$AD$52,10)","v":154},{"$f":"VLOOKUP($A11,datos!$A$4:$AD$52,11)","v":175},{"$f":"VLOOKUP($A11,datos!$A$4:$AD$52,12)","v":164},{"$f":"VLOOKUP($A11,datos!$A$4:$AD$52,13)","v":160},{"$f":"VLOOKUP($A11,datos!$A$4:$AD$52,14)","v":149},{"$f":"VLOOKUP($A11,datos!$A$4:$AD$52,15)","v":204},1006,{"$f":"VLOOKUP($A11,datos!$A$4:$AD$52,16)","v":150},{"$f":"VLOOKUP($A11,datos!$A$4:$AD$52,17)","v":204},{"$f":"VLOOKUP($A11,datos!$A$4:$AD$52,18)","v":217},{"$f":"VLOOKUP($A11,datos!$A$4:$AD$52,19)","v":227},{"$f":"VLOOKUP($A11,datos!$A$4:$AD$52,20)","v":197},{"$f":"VLOOKUP($A11,datos!$A$4:$AD$52,21)","v":194},1189,{"$f":"VLOOKUP($A11,datos!$A$4:$AD$52,22)","v":164},{"$f":"VLOOKUP($A11,datos!$A$4:$AD$52,23)","v":167},{"$f":"VLOOKUP($A11,datos!$A$4:$AD$52,24)","v":233},{"$f":"VLOOKUP($A11,datos!$A$4:$AD$52,25)","v":185},{"$f":"VLOOKUP($A11,datos!$A$4:$AD$52,26)","v":173},{"$f":"VLOOKUP($A11,datos!$A$4:$AD$52,27)","v":213},1135,{"$f":"VLOOKUP($A11,datos!$A$4:$AD$52,28)","v":24},{"$f":"VLOOKUP($A11,datos!$A$4:$AD$52,29)","v":4636},193.16666666666666,"5º",{"$error":"#N/A"}]
["J25",{"$f":"VLOOKUP($A12,datos!$A$4:$AD$52,2)","v":"SEBASTIAN DONADO"},{"$f":"VLOOKUP($A12,datos!$A$4:$AD$52,3)","v":"Colombia"},{"$f":"VLOOKUP($A12,datos!$A$4:$AD$52,4)","v":231},{"$f":"VLOOKUP($A12,datos!$A$4:$AD$52,5)","v":201},{"$f":"VLOOKUP($A12,datos!$A$4:$AD$52,6)","v":195},{"$f":"VLOOKUP($A12,datos!$A$4:$AD$52,7)","v":222},{"$f":"VLOOKUP($A12,datos!$A$4:$AD$52,8)","v":152},{"$f":"VLOOKUP($A12,datos!$A$4:$AD$52,9)","v":155},1156,{"$f":"VLOOKUP($A12,datos!$A$4:$AD$52,10)","v":173},{"$f":"VLOOKUP($A12,datos!$A$4:$AD$52,11)","v":197},{"$f":"VLOOKUP($A12,datos!$A$4:$AD$52,12)","v":200},{"$f":"VLOOKUP($A12,datos!$A$4:$AD$52,13)","v":157},{"$f":"VLOOKUP($A12,datos!$A$4:$AD$52,14)","v":214},{"$f":"VLOOKUP($A12,datos!$A$4:$AD$52,15)","v":202},1143,{"$f":"VLOOKUP($A12,datos!$A$4:$AD$52,16)","v":215},{"$f":"VLOOKUP($A12,datos!$A$4:$AD$52,17)","v":204},{"$f":"VLOOKUP($A12,datos!$A$4:$AD$52,18)","v":238},{"$f":"VLOOKUP($A12,datos!$A$4:$AD$52,19)","v":203},{"$f":"VLOOKUP($A12,datos!$A$4:$AD$52,20)","v":157},{"$f":"VLOOKUP($A12,datos!$A$4:$AD$52,21)","v":201},1218,{"$f":"VLOOKUP($A12,datos!$A$4:$AD$52,22)","v":170},{"$f":"VLOOKUP($A12,datos!$A$4:$AD$52,23)","v":160},{"$f":"VLOOKUP($A12,datos!$A$4:$AD$52,24)","v":168},{"$f":"VLOOKUP($A12,datos!$A$4:$AD$52,25)","v":175},{"$f":"VLOOKUP($A12,datos!$A$4:$AD$52,26)","v":206},{"$f":"VLOOKUP($A12,datos!$A$4:$AD$52,27)","v":210},1089,{"$f":"VLOOKUP($A12,datos!$A$4:$AD$52,28)","v":24},{"$f":"VLOOKUP($A12,datos!$A$4:$AD$52,29)","v":4606},191.91666666666666,"6º",{"$error":"#N/A"}]
["J33",{"$f":"VLOOKUP($A13,datos!$A$4:$AD$52,2)","v":"JUAN ANDRES YUZURIHA"},{"$f":"VLOOKUP($A13,datos!$A$4:$AD$52,3)","v":"Perú"},{"$f":"VLOOKUP($A13,datos!$A$4:$AD$52,4)","v":145},{"$f":"VLOOKUP($A13,datos!$A$4:$AD$52,5)","v":190},{"$f":"VLOOKUP($A13,datos!$A$4:$AD$52,6)","v":181},{"$f":"VLOOKUP($A13,datos!$A$4:$AD$52,7)","v":202},{"$f":"VLOOKUP($A13,datos!$A$4:$AD$52,8)","v":213},{"$f":"VLOOKUP($A13,datos!$A$4:$AD$52,9)","v":189},1120,{"$f":"VLOOKUP($A13,datos!$A$4:$AD$52,10)","v":213},{"$f":"VLOOKUP($A13,datos!$A$4:$AD$52,11)","v":183},{"$f":"VLOOKUP($A13,datos!$A$4:$AD$52,12)","v":159},{"$f":"VLOOKUP($A13,datos!$A$4:$AD$52,13)","v":183},{"$f":"VLOOKUP($A13,datos!$A$4:$AD$52,14)","v":207},{"$f":"VLOOKUP($A13,datos!$A$4:$AD$52,15)","v":205},1150,{"$f":"VLOOKUP($A13,datos!$A$4:$AD$52,16)","v":233},{"$f":"VLOOKUP($A13,datos!$A$4:$AD$52,17)","v":188},{"$f":"VLOOKUP($A13,datos!$A$4:$AD$52,18)","v":188},{"$f":"VLOOKUP($A13,datos!$A$4:$AD$52,19)","v":170},{"$f":"VLOOKUP($A13,datos!$A$4:$AD$52,20)","v":164},{"$f":"VLOOKUP($A13,datos!$A$4:$AD$52,21)","v":175},1118,{"$f":"VLOOKUP($A13,datos!$A$4:$AD$52,22)","v":186},{"$f":"VLOOKUP($A13,datos!$A$4:$AD$52,23)","v":187},{"$f":"VLOOKUP($A13,datos!$A$4:$AD$52,24)","v":222},{"$f":"VLOOKUP($A13,datos!$A$4:$AD$52,25)","v":211},{"$f":"VLOOKUP($A13,datos!$A$4:$AD$52,26)","v":234},{"$f":"VLOOKUP($A13,datos!$A$4:$AD$52,27)","v":171},1211,{"$f":"VLOOKUP($A13,datos!$A$4:$AD$52,28)","v":24},{"$f":"VLOOKUP($A13,datos!$A$4:$AD$52,29)","v":4599},191.625,"7º",{"$error":"#N/A"}]
["J13",{"$f":"VLOOKUP($A14,datos!$A$4:$AD$52,2)","v":"FRANCO R. GUALINI"},{"$f":"VLOOKUP($A14,datos!$A$4:$AD$52,3)","v":"Argentina"},{"$f":"VLOOKUP($A14,datos!$A$4:$AD$52,4)","v":200},{"$f":"VLOOKUP($A14,datos!$A$4:$AD$52,5)","v":185},{"$f":"VLOOKUP($A14,datos!$A$4:$AD$52,6)","v":192},{"$f":"VLOOKUP($A14,datos!$A$4:$AD$52,7)","v":204},{"$f":"VLOOKUP($A14,datos!$A$4:$AD$52,8)","v":177},{"$f":"VLOOKUP($A14,datos!$A$4:$AD$52,9)","v":215},1173,{"$f":"VLOOKUP($A14,datos!$A$4:$AD$52,10)","v":168},{"$f":"VLOOKUP($A14,datos!$A$4:$AD$52,11)","v":172},{"$f":"VLOOKUP($A14,datos!$A$4:$AD$52,12)","v":180},{"$f":"VLOOKUP($A14,datos!$A$4:$AD$52,13)","v":188},{"$f":"VLOOKUP($A14,datos!$A$4:$AD$52,14)","v":182},{"$f":"VLOOKUP($A14,datos!$A$4:$AD$52,15)","v":198},1088,{"$f":"VLOOKUP($A14,datos!$A$4:$AD$52,16)","v":187},{"$f":"VLOOKUP($A14,datos!$A$4:$AD$52,17)","v":160},{"$f":"VLOOKUP($A14,datos!$A$4:$AD$52,18)","v":229},{"$f":"VLOOKUP($A14,datos!$A$4:$AD$52,19)","v":203},{"$f":"VLOOKUP($A14,datos!$A$4:$AD$52,20)","v":189},{"$f":"VLOOKUP($A14,datos!$A$4:$AD$52,21)","v":224},1192,{"$f":"VLOOKUP($A14,datos!$A$4:$AD$52,22)","v":178},{"$f":"VLOOKUP($A14,datos!$A$4:$AD$52,23)","v":234},{"$f":"VLOOKUP($A14,datos!$A$4:$AD$52,24)","v":156},{"$f":"VLOOKUP($A14,datos!$A$4:$AD$52,25)","v":226},{"$f":"VLOOKUP($A14,datos!$A$4:$AD$52,26)","v":162},{"$f":"VLOOKUP($A14,datos!$A$4:$AD$52,27)","v":155},1111,{"$f":"VLOOKUP($A14,datos!$A$4:$AD$52,28)","v":24},{"$f":"VLOOKUP($A14,datos!$A$4:$AD$52,29)","v":4564},190.16666666666666,"8º",{"$error":"#N/A"}]
["J15",{"$f":"VLOOKUP($A15,datos!$A$4:$AD$52,2)","v":"FERNANDO TAPIA M."},{"$f":"VLOOKUP($A15,datos!$A$4:$AD$52,3)","v":"Argentina"},{"$f":"VLOOKUP($A15,datos!$A$4:$AD$52,4)","v":193},{"$f":"VLOOKUP($A15,datos!$A$4:$AD$52,5)","v":223},{"$f":"VLOOKUP($A15,datos!$A$4:$AD$52,6)","v":180},{"$f":"VLOOKUP($A15,datos!$A$4:$AD$52,7)","v":214},{"$f":"VLOOKUP($A15,datos!$A$4:$AD$52,8)","v":183},{"$f":"VLOOKUP($A15,datos!$A$4:$AD$52,9)","v":161},1154,{"$f":"VLOOKUP($A15,datos!$A$4:$AD$52,10)","v":205},{"$f":"VLOOKUP($A15,datos!$A$4:$AD$52,11)","v":180},{"$f":"VLOOKUP($A15,datos!$A$4:$AD$52,12)","v":149},{"$f":"VLOOKUP($A15,datos!$A$4:$AD$52,13)","v":157},{"$f":"VLOOKUP($A15,datos!$A$4:$AD$52,14)","v":176},{"$f":"VLOOKUP($A15,datos!$A$4:$AD$52,15)","v":187},1054,{"$f":"VLOOKUP($A15,datos!$A$4:$AD$52,16)","v":206},{"$f":"VLOOKUP($A15,datos!$A$4:$AD$52,17)","v":182},{"$f":"VLOOKUP($A15,datos!$A$4:$AD$52,18)","v":179},{"$f":"VLOOKUP($A15,datos!$A$4:$AD$52,19)","v":201},{"$f":"VLOOKUP($A15,datos!$A$4:$AD$52,20)","v":202},{"$f":"VLOOKUP($A15,datos!$A$4:$AD$52,21)","v":171},1141,{"$f":"VLOOKUP($A15,datos!$A$4:$AD$52,22)","v":251},{"$f":"VLOOKUP($A15,datos!$A$4:$AD$52,23)","v":171},{"$f":"VLOOKUP($A15,datos!$A$4:$AD$52,24)","v":184},{"$f":"VLOOKUP($A15,datos!$A$4:$AD$52,25)","v":192},{"$f":"VLOOKUP($A15,datos!$A$4:$AD$52,26)","v":165},{"$f":"VLOOKUP($A15,datos!$A$4:$AD$52,27)","v":181},1144,{"$f":"VLOOKUP($A15,datos!$A$4:$AD$52,28)","v":24},{"$f":"VLOOKUP($A15,datos!$A$4:$AD$52,29)","v":4493},187.20833333333334,"9º",{"$error":"#N/A"}]
["J22",{"$f":"VLOOKUP($A16,datos!$A$4:$AD$52,2)","v":"THIAGO FELICETTI"},{"$f":"VLOOKUP($A16,datos!$A$4:$AD$52,3)","v":"Brasil"},{"$f":"VLOOKUP($A16,datos!$A$4:$AD$52,4)","v":183},{"$f":"VLOOKUP($A16,datos!$A$4:$AD$52,5)","v":157},{"$f":"VLOOKUP($A16,datos!$A$4:$AD$52,6)","v":211},{"$f":"VLOOKUP($A16,datos!$A$4:$AD$52,7)","v":224},{"$f":"VLOOKUP($A16,datos!$A$4:$AD$52,8)","v":154},{"$f":"VLOOKUP($A16,datos!$A$4:$AD$52,9)","v":234},1163,{"$f":"VLOOKUP($A16,datos!$A$4:$AD$52,10)","v":134},{"$f":"VLOOKUP($A16,datos!$A$4:$AD$52,11)","v":214},{"$f":"VLOOKUP($A16,datos!$A$4:$AD$52,12)","v":235},{"$f":"VLOOKUP($A16,datos!$A$4:$AD$52,13)","v":173},{"$f":"VLOOKUP($A16,datos!$A$4:$AD$52,14)","v":133},{"$f":"VLOOKUP($A16,datos!$A$4:$AD$52,15)","v":173},1062,{"$f":"VLOOKUP($A16,datos!$A$4:$AD$52,16)","v":180},{"$f":"VLOOKUP($A16,datos!$A$4:$AD$52,17)","v":184},{"$f":"VLOOKUP($A16,datos!$A$4:$AD$52,18)","v":233},{"$f":"VLOOKUP($A16,datos!$A$4:$AD$52,19)","v":235},{"$f":"VLOOKUP($A16,datos!$A$4:$AD$52,20)","v":180},{"$f":"VLOOKUP($A16,datos!$A$4:$AD$52,21)","v":162},1174,{"$f":"VLOOKUP($A16,datos!$A$4:$AD$52,22)","v":210},{"$f":"VLOOKUP($A16,datos!$A$4:$AD$52,23)","v":158},{"$f":"VLOOKUP($A16,datos!$A$4:$AD$52,24)","v":227},{"$f":"VLOOKUP($A16,datos!$A$4:$AD$52,25)","v":161},{"$f":"VLOOKUP($A16,datos!$A$4:$AD$52,26)","v":145},{"$f":"VLOOKUP($A16,datos!$A$4:$AD$52,27)","v":171},1072,{"$f":"VLOOKUP($A16,datos!$A$4:$AD$52,28)","v":24},{"$f":"VLOOKUP($A16,datos!$A$4:$AD$52,29)","v":4471},186.29166666666666,"10º",{"$error":"#N/A"}]
["J23",{"$f":"VLOOKUP($A17,datos!$A$4:$AD$52,2)","v":"JOAO I. FERREIRA N. "},{"$f":"VLOOKUP($A17,datos!$A$4:$AD$52,3)","v":"Brasil"},{"$f":"VLOOKUP($A17,datos!$A$4:$AD$52,4)","v":199},{"$f":"VLOOKUP($A17,datos!$A$4:$AD$52,5)","v":141},{"$f":"VLOOKUP($A17,datos!$A$4:$AD$52,6)","v":169},{"$f":"VLOOKUP($A17,datos!$A$4:$AD$52,7)","v":183},{"$f":"VLOOKUP($A17,datos!$A$4:$AD$52,8)","v":214},{"$f":"VLOOKUP($A17,datos!$A$4:$AD$52,9)","v":201},1107,{"$f":"VLOOKUP($A17,datos!$A$4:$AD$52,10)","v":157},{"$f":"VLOOKUP($A17,datos!$A$4:$AD$52,11)","v":173},{"$f":"VLOOKUP($A17,datos!$A$4:$AD$52,12)","v":200},{"$f":"VLOOKUP($A17,datos!$A$4:$AD$52,13)","v":192},{"$f":"VLOOKUP($A17,datos!$A$4:$AD$52,14)","v":156},{"$f":"VLOOKUP($A17,datos!$A$4:$AD$52,15)","v":203},1081,{"$f":"VLOOKUP($A17,datos!$A$4:$AD$52,16)","v":212},{"$f":"VLOOKUP($A17,datos!$A$4:$AD$52,17)","v":200},{"$f":"VLOOKUP($A17,datos!$A$4:$AD$52,18)","v":256},{"$f":"VLOOKUP($A17,datos!$A$4:$AD$52,19)","v":156},{"$f":"VLOOKUP($A17,datos!$A$4:$AD$52,20)","v":186},{"$f":"VLOOKUP($A17,datos!$A$4:$AD$52,21)","v":194},1204,{"$f":"VLOOKUP($A17,datos!$A$4:$AD$52,22)","v":148},{"$f":"VLOOKUP($A17,datos!$A$4:$AD$52,23)","v":212},{"$f":"VLOOKUP($A17,datos!$A$4:$AD$52,24)","v":143},{"$f":"VLOOKUP($A17,datos!$A$4:$AD$52,25)","v":190},{"$f":"VLOOKUP($A17,datos!$A$4:$AD$52,26)","v":194},{"$f":"VLOOKUP($A17,datos!$A$4:$AD$52,27)","v":192},1079,{"$f":"VLOOKUP($A17,datos!$A$4:$AD$52,28)","v":24},{"$f":"VLOOKUP($A17,datos!$A$4:$AD$52,29)","v":4471},186.29166666666666,"11º",{"$error":"#N/A"}]
["J35",{"$f":"VLOOKUP($A18,datos!$A$4:$AD$52,2)","v":"RENZO GUIBU K."},{"$f":"VLOOKUP($A18,datos!$A$4:$AD$52,3)","v":"Perú"},{"$f":"VLOOKUP($A18,datos!$A$4:$AD$52,4)","v":214},{"$f":"VLOOKUP($A18,datos!$A$4:$AD$52,5)","v":214},{"$f":"VLOOKUP($A18,datos!$A$4:$AD$52,6)","v":232},{"$f":"VLOOKUP($A18,datos!$A$4:$AD$52,7)","v":224},{"$f":"VLOOKUP($A18,datos!$A$4:$AD$52,8)","v":192},{"$f":"VLOOKUP($A18,datos!$A$4:$AD$52,9)","v":211},1287,{"$f":"VLOOKUP($A18,datos!$A$4:$AD$52,10)","v":154},{"$f":"VLOOKUP($A18,datos!$A$4:$AD$52,11)","v":181},{"$f":"VLOOKUP($A18,datos!$A$4:$AD$52,12)","v":145},{"$f":"VLOOKUP($A18,datos!$A$4:$AD$52,13)","v":199},{"$f":"VLOOKUP($A18,datos!$A$4:$AD$52,14)","v":184},{"$f":"VLOOKUP($A18,datos!$A$4:$AD$52,15)","v":189},1052,{"$f":"VLOOKUP($A18,datos!$A$4:$AD$52,16)","v":148},{"$f":"VLOOKUP($A18,datos!$A$4:$AD$52,17)","v":211},{"$f":"VLOOKUP($A18,datos!$A$4:$AD$52,18)","v":157},{"$f":"VLOOKUP($A18,datos!$A$4:$AD$52,19)","v":178},{"$f":"VLOOKUP($A18,datos!$A$4:$AD$52,20)","v":138},{"$f":"VLOOKUP($A18,datos!$A$4:$AD$52,21)","v":188},1020,{"$f":"VLOOKUP($A18,datos!$A$4:$AD$52,22)","v":233},{"$f":"VLOOKUP($A18,datos!$A$4:$AD$52,23)","v":168},{"$f":"VLOOKUP($A18,datos!$A$4:$AD$52,24)","v":200},{"$f":"VLOOKUP($A18,datos!$A$4:$AD$52,25)","v":179},{"$f":"VLOOKUP($A18,datos!$A$4:$AD$52,26)","v":154},{"$f":"VLOOKUP($A18,datos!$A$4:$AD$52,27)","v":167},1101,{"$f":"VLOOKUP($A18,datos!$A$4:$AD$52,28)","v":24},{"$f":"VLOOKUP($A18,datos!$A$4:$AD$52,29)","v":4460},185.83333333333334,"12º",{"$error":"#N/A"}]
["J17",{"$f":"VLOOKUP($A19,datos!$A$4:$AD$52,2)","v":"YANNICK ROOS"},{"$f":"VLOOKUP($A19,datos!$A$4:$AD$52,3)","v":"Aruba"},{"$f":"VLOOKUP($A19,datos!$A$4:$AD$52,4)","v":162},{"$f":"VLOOKUP($A19,datos!$A$4:$AD$52,5)","v":206},{"$f":"VLOOKUP($A19,datos!$A$4:$AD$52,6)","v":207},{"$f":"VLOOKUP($A19,datos!$A$4:$AD$52,7)","v":204},{"$f":"VLOOKUP($A19,datos!$A$4:$AD$52,8)","v":193},{"$f":"VLOOKUP($A19,datos!$A$4:$AD$52,9)","v":182},1154,{"$f":"VLOOKUP($A19,datos!$A$4:$AD$52,10)","v":187},{"$f":"VLOOKUP($A19,datos!$A$4:$AD$52,11)","v":147},{"$f":"VLOOKUP($A19,datos!$A$4:$AD$52,12)","v":135},{"$f":"VLOOKUP($A19,datos!$A$4:$AD$52,13)","v":143},{"$f":"VLOOKUP($A19,datos!$A$4:$AD$52,14)","v":161},{"$f":"VLOOKUP($A19,datos!$A$4:$AD$52,15)","v":158},931,{"$f":"VLOOKUP($A19,datos!$A$4:$AD$52,16)","v":195},{"$f":"VLOOKUP($A19,datos!$A$4:$AD$52,17)","v":180},{"$f":"VLOOKUP($A19,datos!$A$4:$AD$52,18)","v":193},{"$f":"VLOOKUP($A19,datos!$A$4:$AD$52,19)","v":182},{"$f":"VLOOKUP($A19,datos!$A$4:$AD$52,20)","v":233},{"$f":"VLOOKUP($A19,datos!$A$4:$AD$52,21)","v":200},1183,{"$f":"VLOOKUP($A19,datos!$A$4:$AD$52,22)","v":178},{"$f":"VLOOKUP($A19,datos!$A$4:$AD$52,23)","v":195},{"$f":"VLOOKUP($A19,datos!$A$4:$AD$52,24)","v":172},{"$f":"VLOOKUP($A19,datos!$A$4:$AD$52,25)","v":212},{"$f":"VLOOKUP($A19,datos!$A$4:$AD$52,26)","v":212},{"$f":"VLOOKUP($A19,datos!$A$4:$AD$52,27)","v":192},1161,{"$f":"VLOOKUP($A19,datos!$A$4:$AD$52,28)","v":24},{"$f":"VLOOKUP($A19,datos!$A$4:$AD$52,29)","v":4429},184.54166666666666,"13º",{"$error":"#N/A"}]
["J12",{"$f":"VLOOKUP($A20,datos!$A$4:$AD$52,2)","v":"AGUSTIN LEANDRO A."},{"$f":"VLOOKUP($A20,datos!$A$4:$AD$52,3)","v":"Argentina"},{"$f":"VLOOKUP($A20,datos!$A$4:$AD$52,4)","v":184},{"$f":"VLOOKUP($A20,datos!$A$4:$AD$52,5)","v":165},{"$f":"VLOOKUP($A20,datos!$A$4:$AD$52,6)","v":165},{"$f":"VLOOKUP($A20,datos!$A$4:$AD$52,7)","v":203},{"$f":"VLOOKUP($A20,datos!$A$4:$AD$52,8)","v":178},{"$f":"VLOOKUP($A20,datos!$A$4:$AD$52,9)","v":172},1067,{"$f":"VLOOKUP($A20,datos!$A$4:$AD$52,10)","v":147},{"$f":"VLOOKUP($A20,datos!$A$4:$AD$52,11)","v":210},{"$f":"VLOOKUP($A20,datos!$A$4:$AD$52,12)","v":171},{"$f":"VLOOKUP($A20,datos!$A$4:$AD$52,13)","v":219},{"$f":"VLOOKUP($A20,datos!$A$4:$AD$52,14)","v":157},{"$f":"VLOOKUP($A20,datos!$A$4:$AD$52,15)","v":188},1092,{"$f":"VLOOKUP($A20,datos!$A$4:$AD$52,16)","v":138},{"$f":"VLOOKUP($A20,datos!$A$4:$AD$52,17)","v":177},{"$f":"VLOOKUP($A20,datos!$A$4:$AD$52,18)","v":180},{"$f":"VLOOKUP($A20,datos!$A$4:$AD$52,19)","v":184},{"$f":"VLOOKUP($A20,datos!$A$4:$AD$52,20)","v":221},{"$f":"VLOOKUP($A20,datos!$A$4:$AD$52,21)","v":153},1053,{"$f":"VLOOKUP($A20,datos!$A$4:$AD$52,22)","v":188},{"$f":"VLOOKUP($A20,datos!$A$4:$AD$52,23)","v":199},{"$f":"VLOOKUP($A20,datos!$A$4:$AD$52,24)","v":195},{"$f":"VLOOKUP($A20,datos!$A$4:$AD$52,25)","v":181},{"$f":"VLOOKUP($A20,datos!$A$4:$AD$52,26)","v":191},{"$f":"VLOOKUP($A20,datos!$A$4:$AD$52,27)","v":245},1199,{"$f":"VLOOKUP($A20,datos!$A$4:$AD$52,28)","v":24},{"$f":"VLOOKUP($A20,datos!$A$4:$AD$52,29)","v":4411},183.79166666666666,"14º",{"$error":"#N/A"}]
["J19",{"$f":"VLOOKUP($A21,datos!$A$4:$AD$52,2)","v":"ELIAS HALABI"},{"$f":"VLOOKUP($A21,datos!$A$4:$AD$52,3)","v":"Aruba"},{"$f":"VLOOKUP($A21,datos!$A$4:$AD$52,4)","v":202},{"$f":"VLOOKUP($A21,datos!$A$4:$AD$52,5)","v":155},{"$f":"VLOOKUP($A21,datos!$A$4:$AD$52,6)","v":220},{"$f":"VLOOKUP($A21,datos!$A$4:$AD$52,7)","v":142},{"$f":"VLOOKUP($A21,datos!$A$4:$AD$52,8)","v":206},{"$f":"VLOOKUP($A21,datos!$A$4:$AD$52,9)","v":207},1132,{"$f":"VLOOKUP($A21,datos!$A$4:$AD$52,10)","v":202},{"$f":"VLOOKUP($A21,datos!$A$4:$AD$52,11)","v":154},{"$f":"VLOOKUP($A21,datos!$A$4:$AD$52,12)","v":173},{"$f":"VLOOKUP($A21,datos!$A$4:$AD$52,13)","v":186},{"$f":"VLOOKUP($A21,datos!$A$4:$AD$52,14)","v":182},{"$f":"VLOOKUP($A21,datos!$A$4:$AD$52,15)","v":126},1023,{"$f":"VLOOKUP($A21,datos!$A$4:$AD$52,16)","v":178},{"$f":"VLOOKUP($A21,datos!$A$4:$AD$52,17)","v":167},{"$f":"VLOOKUP($A21,datos!$A$4:$AD$52,18)","v":178},{"$f":"VLOOKUP($A21,datos!$A$4:$AD$52,19)","v":210},{"$f":"VLOOKUP($A21,datos!$A$4:$AD$52,20)","v":170},{"$f":"VLOOKUP($A21,datos!$A$4:$AD$52,21)","v":188},1091,{"$f":"VLOOKUP($A21,datos!$A$4:$AD$52,22)","v":171},{"$f":"VLOOKUP($A21,datos!$A$4:$AD$52,23)","v":171},{"$f":"VLOOKUP($A21,datos!$A$4:$AD$52,24)","v":227},{"$f":"VLOOKUP($A21,datos!$A$4:$AD$52,25)","v":229},{"$f":"VLOOKUP($A21,datos!$A$4:$AD$52,26)","v":159},{"$f":"VLOOKUP($A21,datos!$A$4:$AD$52,27)","v":194},1151,{"$f":"VLOOKUP($A21,datos!$A$4:$AD$52,28)","v":24},{"$f":"VLOOKUP($A21,datos!$A$4:$AD$52,29)","v":4397},183.20833333333334,"15º",{"$error":"#N/A"}]
["J28",{"$f":"VLOOKUP($A22,datos!$A$4:$AD$52,2)","v":"BASTIAN MALDONADO R."},{"$f":"VLOOKUP($A22,datos!$A$4:$AD$52,3)","v":"Chile"},{"$f":"VLOOKUP($A22,datos!$A$4:$AD$52,4)","v":226},{"$f":"VLOOKUP($A22,datos!$A$4:$AD$52,5)","v":169},{"$f":"VLOOKUP($A22,datos!$A$4:$AD$52,6)","v":153},{"$f":"VLOOKUP($A22,datos!$A$4:$AD$52,7)","v":184},{"$f":"VLOOKUP($A22,datos!$A$4:$AD$52,8)","v":189},{"$f":"VLOOKUP($A22,datos!$A$4:$AD$52,9)","v":195},1116,{"$f":"VLOOKUP($A22,datos!$A$4:$AD$52,10)","v":201},{"$f":"VLOOKUP($A22,datos!$A$4:$AD$52,11)","v":148},{"$f":"VLOOKUP($A22,datos!$A$4:$AD$52,12)","v":130},{"$f":"VLOOKUP($A22,datos!$A$4:$AD$52,13)","v":165},{"$f":"VLOOKUP($A22,datos!$A$4:$AD$52,14)","v":165},{"$f":"VLOOKUP($A22,datos!$A$4:$AD$52,15)","v":152},961,{"$f":"VLOOKUP($A22,datos!$A$4:$AD$52,16)","v":182},{"$f":"VLOOKUP($A22,datos!$A$4:$AD$52,17)","v":162},{"$f":"VLOOKUP($A22,datos!$A$4:$AD$52,18)","v":222},{"$f":"VLOOKUP($A22,datos!$A$4:$AD$52,19)","v":234},{"$f":"VLOOKUP($A22,datos!$A$4:$AD$52,20)","v":182},{"$f":"VLOOKUP($A22,datos!$A$4:$AD$52,21)","v":187},1169,{"$f":"VLOOKUP($A22,datos!$A$4:$AD$52,22)","v":148},{"$f":"VLOOKUP($A22,datos!$A$4:$AD$52,23)","v":167},{"$f":"VLOOKUP($A22,datos!$A$4:$AD$52,24)","v":205},{"$f":"VLOOKUP($A22,datos!$A$4:$AD$52,25)","v":200},{"$f":"VLOOKUP($A22,datos!$A$4:$AD$52,26)","v":209},{"$f":"VLOOKUP($A22,datos!$A$4:$AD$52,27)","v":161},1090,{"$f":"VLOOKUP($A22,datos!$A$4:$AD$52,28)","v":24},{"$f":"VLOOKUP($A22,datos!$A$4:$AD$52,29)","v":4336},180.66666666666666,"16º",{"$error":"#N/A"}]
["J18",{"$f":"VLOOKUP($A23,datos!$A$4:$AD$52,2)","v":"OSMAR BISLIP"},{"$f":"VLOOKUP($A23,datos!$A$4:$AD$52,3)","v":"Aruba"},{"$f":"VLOOKUP($A23,datos!$A$4:$AD$52,4)","v":205},{"$f":"VLOOKUP($A23,datos!$A$4:$AD$52,5)","v":195},{"$f":"VLOOKUP($A23,datos!$A$4:$AD$52,6)","v":162},{"$f":"VLOOKUP($A23,datos!$A$4:$AD$52,7)","v":164},{"$f":"VLOOKUP($A23,datos!$A$4:$AD$52,8)","v":192},{"$f":"VLOOKUP($A23,datos!$A$4:$AD$52,9)","v":168},1086,{"$f":"VLOOKUP($A23,datos!$A$4:$AD$52,10)","v":205},{"$f":"VLOOKUP($A23,datos!$A$4:$AD$52,11)","v":159},{"$f":"VLOOKUP($A23,datos!$A$4:$AD$52,12)","v":158},{"$f":"VLOOKUP($A23,datos!$A$4:$AD$52,13)","v":200},{"$f":"VLOOKUP($A23,datos!$A$4:$AD$52,14)","v":145},{"$f":"VLOOKUP($A23,datos!$A$4:$AD$52,15)","v":175},1042,{"$f":"VLOOKUP($A23,datos!$A$4:$AD$52,16)","v":163},{"$f":"VLOOKUP($A23,datos!$A$4:$AD$52,17)","v":172},{"$f":"VLOOKUP($A23,datos!$A$4:$AD$52,18)","v":161},{"$f":"VLOOKUP($A23,datos!$A$4:$AD$52,19)","v":181},{"$f":"VLOOKUP($A23,datos!$A$4:$AD$52,20)","v":193},{"$f":"VLOOKUP($A23,datos!$A$4:$AD$52,21)","v":256},1126,{"$f":"VLOOKUP($A23,datos!$A$4:$AD$52,22)","v":159},{"$f":"VLOOKUP($A23,datos!$A$4:$AD$52,23)","v":195},{"$f":"VLOOKUP($A23,datos!$A$4:$AD$52,24)","v":172},{"$f":"VLOOKUP($A23,datos!$A$4:$AD$52,25)","v":158},{"$f":"VLOOKUP($A23,datos!$A$4:$AD$52,26)","v":221},{"$f":"VLOOKUP($A23,datos!$A$4:$AD$52,27)","v":173},1078,{"$f":"VLOOKUP($A23,datos!$A$4:$AD$52,28)","v":24},{"$f":"VLOOKUP($A23,datos!$A$4:$AD$52,29)","v":4332},180.5,"17º",{"$error":"#N/A"}]
["J21",{"$f":"VLOOKUP($A24,datos!$A$4:$AD$52,2)","v":"BERNARDO ABREU"},{"$f":"VLOOKUP($A24,datos!$A$4:$AD$52,3)","v":"Brasil"},{"$f":"VLOOKUP($A24,datos!$A$4:$AD$52,4)","v":180},{"$f":"VLOOKUP($A24,datos!$A$4:$AD$52,5)","v":177},{"$f":"VLOOKUP($A24,datos!$A$4:$AD$52,6)","v":175},{"$f":"VLOOKUP($A24,datos!$A$4:$AD$52,7)","v":190},{"$f":"VLOOKUP($A24,datos!$A$4:$AD$52,8)","v":194},{"$f":"VLOOKUP($A24,datos!$A$4:$AD$52,9)","v":173},1089,{"$f":"VLOOKUP($A24,datos!$A$4:$AD$52,10)","v":176},{"$f":"VLOOKUP($A24,datos!$A$4:$AD$52,11)","v":154},{"$f":"VLOOKUP($A24,datos!$A$4:$AD$52,12)","v":194},{"$f":"VLOOKUP($A24,datos!$A$4:$AD$52,13)","v":131},{"$f":"VLOOKUP($A24,datos!$A$4:$AD$52,14)","v":169},{"$f":"VLOOKUP($A24,datos!$A$4:$AD$52,15)","v":165},989,{"$f":"VLOOKUP($A24,datos!$A$4:$AD$52,16)","v":184},{"$f":"VLOOKUP($A24,datos!$A$4:$AD$52,17)","v":216},{"$f":"VLOOKUP($A24,datos!$A$4:$AD$52,18)","v":162},{"$f":"VLOOKUP($A24,datos!$A$4:$AD$52,19)","v":200},{"$f":"VLOOKUP($A24,datos!$A$4:$AD$52,20)","v":194},{"$f":"VLOOKUP($A24,datos!$A$4:$AD$52,21)","v":225},1181,{"$f":"VLOOKUP($A24,datos!$A$4:$AD$52,22)","v":150},{"$f":"VLOOKUP($A24,datos!$A$4:$AD$52,23)","v":176},{"$f":"VLOOKUP($A24,datos!$A$4:$AD$52,24)","v":181},{"$f":"VLOOKUP($A24,datos!$A$4:$AD$52,25)","v":156},{"$f":"VLOOKUP($A24,datos!$A$4:$AD$52,26)","v":193},{"$f":"VLOOKUP($A24,datos!$A$4:$AD$52,27)","v":205},1061,{"$f":"VLOOKUP($A24,datos!$A$4:$AD$52,28)","v":24},{"$f":"VLOOKUP($A24,datos!$A$4:$AD$52,29)","v":4320},180,"18º",{"$error":"#N/A"}]
["J32",{"$f":"VLOOKUP($A25,datos!$A$4:$AD$52,2)","v":"ADRIAN GUIBU K."},{"$f":"VLOOKUP($A25,datos!$A$4:$AD$52,3)","v":"Perú"},{"$f":"VLOOKUP($A25,datos!$A$4:$AD$52,4)","v":170},{"$f":"VLOOKUP($A25,datos!$A$4:$AD$52,5)","v":142},{"$f":"VLOOKUP($A25,datos!$A$4:$AD$52,6)","v":139},{"$f":"VLOOKUP($A25,datos!$A$4:$AD$52,7)","v":166},{"$f":"VLOOKUP($A25,datos!$A$4:$AD$52,8)","v":269},{"$f":"VLOOKUP($A25,datos!$A$4:$AD$52,9)","v":193},1079,{"$f":"VLOOKUP($A25,datos!$A$4:$AD$52,10)","v":133},{"$f":"VLOOKUP($A25,datos!$A$4:$AD$52,11)","v":146},{"$f":"VLOOKUP($A25,datos!$A$4:$AD$52,12)","v":224},{"$f":"VLOOKUP($A25,datos!$A$4:$AD$52,13)","v":161},{"$f":"VLOOKUP($A25,datos!$A$4:$AD$52,14)","v":149},{"$f":"VLOOKUP($A25,datos!$A$4:$AD$52,15)","v":191},1004,{"$f":"VLOOKUP($A25,datos!$A$4:$AD$52,16)","v":177},{"$f":"VLOOKUP($A25,datos!$A$4:$AD$52,17)","v":196},{"$f":"VLOOKUP($A25,datos!$A$4:$AD$52,18)","v":172},{"$f":"VLOOKUP($A25,datos!$A$4:$AD$52,19)","v":151},{"$f":"VLOOKUP($A25,datos!$A$4:$AD$52,20)","v":200},{"$f":"VLOOKUP($A25,datos!$A$4:$AD$52,21)","v":148},1044,{"$f":"VLOOKUP($A25,datos!$A$4:$AD$52,22)","v":156},{"$f":"VLOOKUP($A25,datos!$A$4:$AD$52,23)","v":158},{"$f":"VLOOKUP($A25,datos!$A$4:$AD$52,24)","v":222},{"$f":"VLOOKUP($A25,datos!$A$4:$AD$52,25)","v":222},{"$f":"VLOOKUP($A25,datos!$A$4:$AD$52,26)","v":195},{"$f":"VLOOKUP($A25,datos!$A$4:$AD$52,27)","v":191},1144,{"$f":"VLOOKUP($A25,datos!$A$4:$AD$52,28)","v":24},{"$f":"VLOOKUP($A25,datos!$A$4:$AD$52,29)","v":4271},177.95833333333334,"19º",{"$error":"#N/A"}]
["J14",{"$f":"VLOOKUP($A26,datos!$A$4:$AD$52,2)","v":"FABRICIO E. SANDUAY"},{"$f":"VLOOKUP($A26,datos!$A$4:$AD$52,3)","v":"Argentina"},{"$f":"VLOOKUP($A26,datos!$A$4:$AD$52,4)","v":140},{"$f":"VLOOKUP($A26,datos!$A$4:$AD$52,5)","v":150},{"$f":"VLOOKUP($A26,datos!$A$4:$AD$52,6)","v":204},{"$f":"VLOOKUP($A26,datos!$A$4:$AD$52,7)","v":211},{"$f":"VLOOKUP($A26,datos!$A$4:$AD$52,8)","v":146},{"$f":"VLOOKUP($A26,datos!$A$4:$AD$52,9)","v":194},1045,{"$f":"VLOOKUP($A26,datos!$A$4:$AD$52,10)","v":170},{"$f":"VLOOKUP($A26,datos!$A$4:$AD$52,11)","v":171},{"$f":"VLOOKUP($A26,datos!$A$4:$AD$52,12)","v":157},{"$f":"VLOOKUP($A26,datos!$A$4:$AD$52,13)","v":168},{"$f":"VLOOKUP($A26,datos!$A$4:$AD$52,14)","v":178},{"$f":"VLOOKUP($A26,datos!$A$4:$AD$52,15)","v":125},969,{"$f":"VLOOKUP($A26,datos!$A$4:$AD$52,16)","v":202},{"$f":"VLOOKUP($A26,datos!$A$4:$AD$52,17)","v":162},{"$f":"VLOOKUP($A26,datos!$A$4:$AD$52,18)","v":161},{"$f":"VLOOKUP($A26,datos!$A$4:$AD$52,19)","v":176},{"$f":"VLOOKUP($A26,datos!$A$4:$AD$52,20)","v":211},{"$f":"VLOOKUP($A26,datos!$A$4:$AD$52,21)","v":194},1106,{"$f":"VLOOKUP($A26,datos!$A$4:$AD$52,22)","v":203},{"$f":"VLOOKUP($A26,datos!$A$4:$AD$52,23)","v":171},{"$f":"VLOOKUP($A26,datos!$A$4:$AD$52,24)","v":209},{"$f":"VLOOKUP($A26,datos!$A$4:$AD$52,25)","v":178},{"$f":"VLOOKUP($A26,datos!$A$4:$AD$52,26)","v":126},{"$f":"VLOOKUP($A26,datos!$A$4:$AD$52,27)","v":179},1066,{"$f":"VLOOKUP($A26,datos!$A$4:$AD$52,28)","v":24},{"$f":"VLOOKUP($A26,datos!$A$4:$AD$52,29)","v":4186},174.41666666666666,"20º",{"$error":"#N/A"}]
["J34",{"$f":"VLOOKUP($A27,datos!$A$4:$AD$52,2)","v":"KEIJI M. CAJACHACAHUA M."},{"$f":"VLOOKUP($A27,datos!$A$4:$AD$52,3)","v":"Perú"},{"$f":"VLOOKUP($A27,datos!$A$4:$AD$52,4)","v":178},{"$f":"VLOOKUP($A27,datos!$A$4:$AD$52,5)","v":198},{"$f":"VLOOKUP($A27,datos!$A$4:$AD$52,6)","v":183},{"$f":"VLOOKUP($A27,datos!$A$4:$AD$52,7)","v":127},{"$f":"VLOOKUP($A27,datos!$A$4:$AD$52,8)","v":164},{"$f":"VLOOKUP($A27,datos!$A$4:$AD$52,9)","v":150},1000,{"$f":"VLOOKUP($A27,datos!$A$4:$AD$52,10)","v":176},{"$f":"VLOOKUP($A27,datos!$A$4:$AD$52,11)","v":155},{"$f":"VLOOKUP($A27,datos!$A$4:$AD$52,12)","v":147},{"$f":"VLOOKUP($A27,datos!$A$4:$AD$52,13)","v":140},{"$f":"VLOOKUP($A27,datos!$A$4:$AD$52,14)","v":170},{"$f":"VLOOKUP($A27,datos!$A$4:$AD$52,15)","v":206},994,{"$f":"VLOOKUP($A27,datos!$A$4:$AD$52,16)","v":245},{"$f":"VLOOKUP($A27,datos!$A$4:$AD$52,17)","v":187},{"$f":"VLOOKUP($A27,datos!$A$4:$AD$52,18)","v":166},{"$f":"VLOOKUP($A27,datos!$A$4:$AD$52,19)","v":169},{"$f":"VLOOKUP($A27,datos!$A$4:$AD$52,20)","v":234},{"$f":"VLOOKUP($A27,datos!$A$4:$AD$52,21)","v":206},1207,{"$f":"VLOOKUP($A27,datos!$A$4:$AD$52,22)","v":134},{"$f":"VLOOKUP($A27,datos!$A$4:$AD$52,23)","v":138},{"$f":"VLOOKUP($A27,datos!$A$4:$AD$52,24)","v":134},{"$f":"VLOOKUP($A27,datos!$A$4:$AD$52,25)","v":139},{"$f":"VLOOKUP($A27,datos!$A$4:$AD$52,26)","v":135},{"$f":"VLOOKUP($A27,datos!$A$4:$AD$52,27)","v":200},880,{"$f":"VLOOKUP($A27,datos!$A$4:$AD$52,28)","v":24},{"$f":"VLOOKUP($A27,datos!$A$4:$AD$52,29)","v":4081},170.04166666666666,"21º",{"$error":"#N/A"}]
["J29",{"$f":"VLOOKUP($A28,datos!$A$4:$AD$52,2)","v":"MATIAS NAZAR G."},{"$f":"VLOOKUP($A28,datos!$A$4:$AD$52,3)","v":"Chile"},{"$f":"VLOOKUP($A28,datos!$A$4:$AD$52,4)","v":157},{"$f":"VLOOKUP($A28,datos!$A$4:$AD$52,5)","v":167},{"$f":"VLOOKUP($A28,datos!$A$4:$AD$52,6)","v":182},{"$f":"VLOOKUP($A28,datos!$A$4:$AD$52,7)","v":159},{"$f":"VLOOKUP($A28,datos!$A$4:$AD$52,8)","v":149},{"$f":"VLOOKUP($A28,datos!$A$4:$AD$52,9)","v":160},974,{"$f":"VLOOKUP($A28,datos!$A$4:$AD$52,10)","v":141},{"$f":"VLOOKUP($A28,datos!$A$4:$AD$52,11)","v":212},{"$f":"VLOOKUP($A28,datos!$A$4:$AD$52,12)","v":189},{"$f":"VLOOKUP($A28,datos!$A$4:$AD$52,13)","v":195},{"$f":"VLOOKUP($A28,datos!$A$4:$AD$52,14)","v":175},{"$f":"VLOOKUP($A28,datos!$A$4:$AD$52,15)","v":165},1077,{"$f":"VLOOKUP($A28,datos!$A$4:$AD$52,16)","v":199},{"$f":"VLOOKUP($A28,datos!$A$4:$AD$52,17)","v":158},{"$f":"VLOOKUP($A28,datos!$A$4:$AD$52,18)","v":180},{"$f":"VLOOKUP($A28,datos!$A$4:$AD$52,19)","v":212},{"$f":"VLOOKUP($A28,datos!$A$4:$AD$52,20)","v":145},{"$f":"VLOOKUP($A28,datos!$A$4:$AD$52,21)","v":144},1038,{"$f":"VLOOKUP($A28,datos!$A$4:$AD$52,22)","v":156},{"$f":"VLOOKUP($A28,datos!$A$4:$AD$52,23)","v":160},{"$f":"VLOOKUP($A28,datos!$A$4:$AD$52,24)","v":160},{"$f":"VLOOKUP($A28,datos!$A$4:$AD$52,25)","v":185},{"$f":"VLOOKUP($A28,datos!$A$4:$AD$52,26)","v":167},{"$f":"VLOOKUP($A28,datos!$A$4:$AD$52,27)","v":162},990,{"$f":"VLOOKUP($A28,datos!$A$4:$AD$52,28)","v":24},{"$f":"VLOOKUP($A28,datos!$A$4:$AD$52,29)","v":4079},169.95833333333334,"22º",{"$error":"#N/A"}]
["J36",{"$f":"VLOOKUP($A29,datos!$A$4:$AD$52,2)","v":"MATIAS DA MOTTA L."},{"$f":"VLOOKUP($A29,datos!$A$4:$AD$52,3)","v":"Uruguay"},{"$f":"VLOOKUP($A29,datos!$A$4:$AD$52,4)","v":125},{"$f":"VLOOKUP($A29,datos!$A$4:$AD$52,5)","v":158},{"$f":"VLOOKUP($A29,datos!$A$4:$AD$52,6)","v":139},{"$f":"VLOOKUP($A29,datos!$A$4:$AD$52,7)","v":147},{"$f":"VLOOKUP($A29,datos!$A$4:$AD$52,8)","v":124},{"$f":"VLOOKUP($A29,datos!$A$4:$AD$52,9)","v":151},844,{"$f":"VLOOKUP($A29,datos!$A$4:$AD$52,10)","v":134},{"$f":"VLOOKUP($A29,datos!$A$4:$AD$52,11)","v":200},{"$f":"VLOOKUP($A29,datos!$A$4:$AD$52,12)","v":148},{"$f":"VLOOKUP($A29,datos!$A$4:$AD$52,13)","v":138},{"$f":"VLOOKUP($A29,datos!$A$4:$AD$52,14)","v":189},{"$f":"VLOOKUP($A29,datos!$A$4:$AD$52,15)","v":186},995,{"$f":"VLOOKUP($A29,datos!$A$4:$AD$52,16)","v":147},{"$f":"VLOOKUP($A29,datos!$A$4:$AD$52,17)","v":157},{"$f":"VLOOKUP($A29,datos!$A$4:$AD$52,18)","v":144},{"$f":"VLOOKUP($A29,datos!$A$4:$AD$52,19)","v":137},{"$f":"VLOOKUP($A29,datos!$A$4:$AD$52,20)","v":195},{"$f":"VLOOKUP($A29,datos!$A$4:$AD$52,21)","v":137},917,{"$f":"VLOOKUP($A29,datos!$A$4:$AD$52,22)","v":174},{"$f":"VLOOKUP($A29,datos!$A$4:$AD$52,23)","v":205},{"$f":"VLOOKUP($A29,datos!$A$4:$AD$52,24)","v":111},{"$f":"VLOOKUP($A29,datos!$A$4:$AD$52,25)","v":125},{"$f":"VLOOKUP($A29,datos!$A$4:$AD$52,26)","v":146},{"$f":"VLOOKUP($A29,datos!$A$4:$AD$52,27)","v":139},900,{"$f":"VLOOKUP($A29,datos!$A$4:$AD$52,28)","v":24},{"$f":"VLOOKUP($A29,datos!$A$4:$AD$52,29)","v":3656},152.33333333333334,"23º",{"$error":"#N/A"}]
["J38",{"$f":"VLOOKUP($A30,datos!$A$4:$AD$52,2)","v":"FELIPE FUENTES F."},{"$f":"VLOOKUP($A30,datos!$A$4:$AD$52,3)","v":"Uruguay"},{"$f":"VLOOKUP($A30,datos!$A$4:$AD$52,4)","v":150},{"$f":"VLOOKUP($A30,datos!$A$4:$AD$52,5)","v":125},{"$f":"VLOOKUP($A30,datos!$A$4:$AD$52,6)","v":174},{"$f":"VLOOKUP($A30,datos!$A$4:$AD$52,7)","v":191},{"$f":"VLOOKUP($A30,datos!$A$4:$AD$52,8)","v":152},{"$f":"VLOOKUP($A30,datos!$A$4:$AD$52,9)","v":140},932,{"$f":"VLOOKUP($A30,datos!$A$4:$AD$52,10)","v":123},{"$f":"VLOOKUP($A30,datos!$A$4:$AD$52,11)","v":146},{"$f":"VLOOKUP($A30,datos!$A$4:$AD$52,12)","v":138},{"$f":"VLOOKUP($A30,datos!$A$4:$AD$52,13)","v":130},{"$f":"VLOOKUP($A30,datos!$A$4:$AD$52,14)","v":154},{"$f":"VLOOKUP($A30,datos!$A$4:$AD$52,15)","v":125},816,{"$f":"VLOOKUP($A30,datos!$A$4:$AD$52,16)","v":146},{"$f":"VLOOKUP($A30,datos!$A$4:$AD$52,17)","v":130},{"$f":"VLOOKUP($A30,datos!$A$4:$AD$52,18)","v":108},{"$f":"VLOOKUP($A30,datos!$A$4:$AD$52,19)","v":154},{"$f":"VLOOKUP($A30,datos!$A$4:$AD$52,20)","v":142},{"$f":"VLOOKUP($A30,datos!$A$4:$AD$52,21)","v":194},874,{"$f":"VLOOKUP($A30,datos!$A$4:$AD$52,22)","v":157},{"$f":"VLOOKUP($A30,datos!$A$4:$AD$52,23)","v":184},{"$f":"VLOOKUP($A30,datos!$A$4:$AD$52,24)","v":211},{"$f":"VLOOKUP($A30,datos!$A$4:$AD$52,25)","v":131},{"$f":"VLOOKUP($A30,datos!$A$4:$AD$52,26)","v":168},{"$f":"VLOOKUP($A30,datos!$A$4:$AD$52,27)","v":161},1012,{"$f":"VLOOKUP($A30,datos!$A$4:$AD$52,28)","v":24},{"$f":"VLOOKUP($A30,datos!$A$4:$AD$52,29)","v":3634},151.41666666666666,"24º",{"$error":"#N/A"}]
["J37",{"$f":"VLOOKUP($A31,datos!$A$4:$AD$52,2)","v":"ALFONSO RODRIGUEZ L."},{"$f":"VLOOKUP($A31,datos!$A$4:$AD$52,3)","v":"Uruguay"},{"$f":"VLOOKUP($A31,datos!$A$4:$AD$52,4)","v":163},{"$f":"VLOOKUP($A31,datos!$A$4:$AD$52,5)","v":160},{"$f":"VLOOKUP($A31,datos!$A$4:$AD$52,6)","v":107},{"$f":"VLOOKUP($A31,datos!$A$4:$AD$52,7)","v":130},{"$f":"VLOOKUP($A31,datos!$A$4:$AD$52,8)","v":180},{"$f":"VLOOKUP($A31,datos!$A$4:$AD$52,9)","v":151},891,{"$f":"VLOOKUP($A31,datos!$A$4:$AD$52,10)","v":154},{"$f":"VLOOKUP($A31,datos!$A$4:$AD$52,11)","v":158},{"$f":"VLOOKUP($A31,datos!$A$4:$AD$52,12)","v":148},{"$f":"VLOOKUP($A31,datos!$A$4:$AD$52,13)","v":128},{"$f":"VLOOKUP($A31,datos!$A$4:$AD$52,14)","v":142},{"$f":"VLOOKUP($A31,datos!$A$4:$AD$52,15)","v":132},862,{"$f":"VLOOKUP($A31,datos!$A$4:$AD$52,16)","v":194},{"$f":"VLOOKUP($A31,datos!$A$4:$AD$52,17)","v":137},{"$f":"VLOOKUP($A31,datos!$A$4:$AD$52,18)","v":128},{"$f":"VLOOKUP($A31,datos!$A$4:$AD$52,19)","v":112},{"$f":"VLOOKUP($A31,datos!$A$4:$AD$52,20)","v":121},{"$f":"VLOOKUP($A31,datos!$A$4:$AD$52,21)","v":144},836,{"$f":"VLOOKUP($A31,datos!$A$4:$AD$52,22)","v":139},{"$f":"VLOOKUP($A31,datos!$A$4:$AD$52,23)","v":156},{"$f":"VLOOKUP($A31,datos!$A$4:$AD$52,24)","v":130},{"$f":"VLOOKUP($A31,datos!$A$4:$AD$52,25)","v":151},{"$f":"VLOOKUP($A31,datos!$A$4:$AD$52,26)","v":131},{"$f":"VLOOKUP($A31,datos!$A$4:$AD$52,27)","v":167},874,{"$f":"VLOOKUP($A31,datos!$A$4:$AD$52,28)","v":24},{"$f":"VLOOKUP($A31,datos!$A$4:$AD$52,29)","v":3463},144.29166666666666,"25º",{"$error":"#N/A"}]
["J30",{"$f":"VLOOKUP($A32,datos!$A$4:$AD$52,2)","v":"IVAN VELIZ H."},{"$f":"VLOOKUP($A32,datos!$A$4:$AD$52,3)","v":"Chile"},{"$f":"VLOOKUP($A32,datos!$A$4:$AD$52,4)","v":158},{"$f":"VLOOKUP($A32,datos!$A$4:$AD$52,5)","v":133},{"$f":"VLOOKUP($A32,datos!$A$4:$AD$52,6)","v":123},{"$f":"VLOOKUP($A32,datos!$A$4:$AD$52,7)","v":158},{"$f":"VLOOKUP($A32,datos!$A$4:$AD$52,8)","v":137},{"$f":"VLOOKUP($A32,datos!$A$4:$AD$52,9)","v":112},821,{"$f":"VLOOKUP($A32,datos!$A$4:$AD$52,10)","v":154},{"$f":"VLOOKUP($A32,datos!$A$4:$AD$52,11)","v":144},{"$f":"VLOOKUP($A32,datos!$A$4:$AD$52,12)","v":168},{"$f":"VLOOKUP($A32,datos!$A$4:$AD$52,13)","v":169},{"$f":"VLOOKUP($A32,datos!$A$4:$AD$52,14)","v":158},{"$f":"VLOOKUP($A32,datos!$A$4:$AD$52,15)","v":114},907,{"$f":"VLOOKUP($A32,datos!$A$4:$AD$52,16)","v":131},{"$f":"VLOOKUP($A32,datos!$A$4:$AD$52,17)","v":153},{"$f":"VLOOKUP($A32,datos!$A$4:$AD$52,18)","v":110},{"$f":"VLOOKUP($A32,datos!$A$4:$AD$52,19)","v":177},{"$f":"VLOOKUP($A32,datos!$A$4:$AD$52,20)","v":145},{"$f":"VLOOKUP($A32,datos!$A$4:$AD$52,21)","v":142},858,{"$f":"VLOOKUP($A32,datos!$A$4:$AD$52,22)","v":150},{"$f":"VLOOKUP($A32,datos!$A$4:$AD$52,23)","v":163},{"$f":"VLOOKUP($A32,datos!$A$4:$AD$52,24)","v":144},{"$f":"VLOOKUP($A32,datos!$A$4:$AD$52,25)","v":168},{"$f":"VLOOKUP($A32,datos!$A$4:$AD$52,26)","v":155},{"$f":"VLOOKUP($A32,datos!$A$4:$AD$52,27)","v":95},875,{"$f":"VLOOKUP($A32,datos!$A$4:$AD$52,28)","v":24},{"$f":"VLOOKUP($A32,datos!$A$4:$AD$52,29)","v":3461},144.20833333333334,"26º",{"$error":"#N/A"}]
["J31",{"$f":"VLOOKUP($A33,datos!$A$4:$AD$52,2)","v":"LUIS JEREZ G."},{"$f":"VLOOKUP($A33,datos!$A$4:$AD$52,3)","v":"Chile"},{"$f":"VLOOKUP($A33,datos!$A$4:$AD$52,4)","v":154},{"$f":"VLOOKUP($A33,datos!$A$4:$AD$52,5)","v":116},{"$f":"VLOOKUP($A33,datos!$A$4:$AD$52,6)","v":117},{"$f":"VLOOKUP($A33,datos!$A$4:$AD$52,7)","v":116},{"$f":"VLOOKUP($A33,datos!$A$4:$AD$52,8)","v":103},{"$f":"VLOOKUP($A33,datos!$A$4:$AD$52,9)","v":103},709,{"$f":"VLOOKUP($A33,datos!$A$4:$AD$52,10)","v":155},{"$f":"VLOOKUP($A33,datos!$A$4:$AD$52,11)","v":159},{"$f":"VLOOKUP($A33,datos!$A$4:$AD$52,12)","v":116},{"$f":"VLOOKUP($A33,datos!$A$4:$AD$52,13)","v":128},{"$f":"VLOOKUP($A33,datos!$A$4:$AD$52,14)","v":103},{"$f":"VLOOKUP($A33,datos!$A$4:$AD$52,15)","v":144},805,{"$f":"VLOOKUP($A33,datos!$A$4:$AD$52,16)","v":125},{"$f":"VLOOKUP($A33,datos!$A$4:$AD$52,17)","v":115},{"$f":"VLOOKUP($A33,datos!$A$4:$AD$52,18)","v":89},{"$f":"VLOOKUP($A33,datos!$A$4:$AD$52,19)","v":133},{"$f":"VLOOKUP($A33,datos!$A$4:$AD$52,20)","v":176},{"$f":"VLOOKUP($A33,datos!$A$4:$AD$52,21)","v":151},789,{"$f":"VLOOKUP($A33,datos!$A$4:$AD$52,22)","v":157},{"$f":"VLOOKUP($A33,datos!$A$4:$AD$52,23)","v":124},{"$f":"VLOOKUP($A33,datos!$A$4:$AD$52,24)","v":166},{"$f":"VLOOKUP($A33,datos!$A$4:$AD$52,25)","v":125},{"$f":"VLOOKUP($A33,datos!$A$4:$AD$52,26)","v":123},{"$f":"VLOOKUP($A33,datos!$A$4:$AD$52,27)","v":126},821,{"$f":"VLOOKUP($A33,datos!$A$4:$AD$52,28)","v":24},{"$f":"VLOOKUP($A33,datos!$A$4:$AD$52,29)","v":3124},130.16666666666666,"27º",{"$error":"#N/A"}]
["J39",{"$f":"VLOOKUP($A34,datos!$A$4:$AD$52,2)","v":"FELIPE FUENTES F."},{"$f":"VLOOKUP($A34,datos!$A$4:$AD$52,3)","v":"Uruguay"},{"$f":"VLOOKUP($A34,datos!$A$4:$AD$52,4)","v":150},{"$f":"VLOOKUP($A34,datos!$A$4:$AD$52,5)","v":125},{"$f":"VLOOKUP($A34,datos!$A$4:$AD$52,6)","v":174},{"$f":"VLOOKUP($A34,datos!$A$4:$AD$52,7)","v":191},{"$f":"VLOOKUP($A34,datos!$A$4:$AD$52,8)","v":152},{"$f":"VLOOKUP($A34,datos!$A$4:$AD$52,9)","v":140},932,{"$f":"VLOOKUP($A34,datos!$A$4:$AD$52,10)","v":123},{"$f":"VLOOKUP($A34,datos!$A$4:$AD$52,11)","v":146},{"$f":"VLOOKUP($A34,datos!$A$4:$AD$52,12)","v":138},{"$f":"VLOOKUP($A34,datos!$A$4:$AD$52,13)","v":130},{"$f":"VLOOKUP($A34,datos!$A$4:$AD$52,14)","v":154},{"$f":"VLOOKUP($A34,datos!$A$4:$AD$52,15)","v":125},816,{"$f":"VLOOKUP($A34,datos!$A$4:$AD$52,16)","v":146},{"$f":"VLOOKUP($A34,datos!$A$4:$AD$52,17)","v":130},{"$f":"VLOOKUP($A34,datos!$A$4:$AD$52,18)","v":108},{"$f":"VLOOKUP($A34,datos!$A$4:$AD$52,19)","v":154},{"$f":"VLOOKUP($A34,datos!$A$4:$AD$52,20)","v":142},{"$f":"VLOOKUP($A34,datos!$A$4:$AD$52,21)","v":194},874,{"$f":"VLOOKUP($A34,datos!$A$4:$AD$52,22)","v":157},{"$f":"VLOOKUP($A34,datos!$A$4:$AD$52,23)","v":184},{"$f":"VLOOKUP($A34,datos!$A$4:$AD$52,24)","v":211},{"$f":"VLOOKUP($A34,datos!$A$4:$AD$52,25)","v":131},{"$f":"VLOOKUP($A34,datos!$A$4:$AD$52,26)","v":168},{"$f":"VLOOKUP($A34,datos!$A$4:$AD$52,27)","v":161},1012,{"$f":"VLOOKUP($A34,datos!$A$4:$AD$52,28)","v":24},{"$f":"VLOOKUP($A34,datos!$A$4:$AD$52,29)","v":3634},151.41666666666666,"28º",{"$error":"#N/A"}]
["J40",{"$f":"VLOOKUP($A35,datos!$A$4:$AD$52,2)","v":"FELIPE FUENTES F."},{"$f":"VLOOKUP($A35,datos!$A$4:$AD$52,3)","v":"Uruguay"},{"$f":"VLOOKUP($A35,datos!$A$4:$AD$52,4)","v":150},{"$f":"VLOOKUP($A35,datos!$A$4:$AD$52,5)","v":125},{"$f":"VLOOKUP($A35,datos!$A$4:$AD$52,6)","v":174},{"$f":"VLOOKUP($A35,datos!$A$4:$AD$52,7)","v":191},{"$f":"VLOOKUP($A35,datos!$A$4:$AD$52,8)","v":152},{"$f":"VLOOKUP($A35,datos!$A$4:$AD$52,9)","v":140},932,{"$f":"VLOOKUP($A35,datos!$A$4:$AD$52,10)","v":123},{"$f":"VLOOKUP($A35,datos!$A$4:$AD$52,11)","v":146},{"$f":"VLOOKUP($A35,datos!$A$4:$AD$52,12)","v":138},{"$f":"VLOOKUP($A35,datos!$A$4:$AD$52,13)","v":130},{"$f":"VLOOKUP($A35,datos!$A$4:$AD$52,14)","v":154},{"$f":"VLOOKUP($A35,datos!$A$4:$AD$52,15)","v":125},816,{"$f":"VLOOKUP($A35,datos!$A$4:$AD$52,16)","v":146},{"$f":"VLOOKUP($A35,datos!$A$4:$AD$52,17)","v":130},{"$f":"VLOOKUP($A35,datos!$A$4:$AD$52,18)","v":108},{"$f":"VLOOKUP($A35,datos!$A$4:$AD$52,19)","v":154},{"$f":"VLOOKUP($A35,datos!$A$4:$AD$52,20)","v":142},{"$f":"VLOOKUP($A35,datos!$A$4:$AD$52,21)","v":194},874,{"$f":"VLOOKUP($A35,datos!$A$4:$AD$52,22)","v":157},{"$f":"VLOOKUP($A35,datos!$A$4:$AD$52,23)","v":184},{"$f":"VLOOKUP($A35,datos!$A$4:$AD$52,24)","v":211},{"$f":"VLOOKUP($A35,datos!$A$4:$AD$52,25)","v":131},{"$f":"VLOOKUP($A35,datos!$A$4:$AD$52,26)","v":168},{"$f":"VLOOKUP($A35,datos!$A$4:$AD$52,27)","v":161},1012,{"$f":"VLOOKUP($A35,datos!$A$4:$AD$52,28)","v":24},{"$f":"VLOOKUP($A35,datos!$A$4:$AD$52,29)","v":3634},151.41666666666666,"29º",{"$error":"#N/A"}]
["J41",{"$f":"VLOOKUP($A36,datos!$A$4:$AD$52,2)","v":"FELIPE FUENTES F."},{"$f":"VLOOKUP($A36,datos!$A$4:$AD$52,3)","v":"Uruguay"},{"$f":"VLOOKUP($A36,datos!$A$4:$AD$52,4)","v":150},{"$f":"VLOOKUP($A36,datos!$A$4:$AD$52,5)","v":125},{"$f":"VLOOKUP($A36,datos!$A$4:$AD$52,6)","v":174},{"$f":"VLOOKUP($A36,datos!$A$4:$AD$52,7)","v":191},{"$f":"VLOOKUP($A36,datos!$A$4:$AD$52,8)","v":152},{"$f":"VLOOKUP($A36,datos!$A$4:$AD$52,9)","v":140},932,{"$f":"VLOOKUP($A36,datos!$A$4:$AD$52,10)","v":123},{"$f":"VLOOKUP($A36,datos!$A$4:$AD$52,11)","v":146},{"$f":"VLOOKUP($A36,datos!$A$4:$AD$52,12)","v":138},{"$f":"VLOOKUP($A36,datos!$A$4:$AD$52,13)","v":130},{"$f":"VLOOKUP($A36,datos!$A$4:$AD$52,14)","v":154},{"$f":"VLOOKUP($A36,datos!$A$4:$AD$52,15)","v":125},816,{"$f":"VLOOKUP($A36,datos!$A$4:$AD$52,16)","v":146},{"$f":"VLOOKUP($A36,datos!$A$4:$AD$52,17)","v":130},{"$f":"VLOOKUP($A36,datos!$A$4:$AD$52,18)","v":108},{"$f":"VLOOKUP($A36,datos!$A$4:$AD$52,19)","v":154},{"$f":"VLOOKUP($A36,datos!$A$4:$AD$52,20)","v":142},{"$f":"VLOOKUP($A36,datos!$A$4:$AD$52,21)","v":194},874,{"$f":"VLOOKUP($A36,datos!$A$4:$AD$52,22)","v":157},{"$f":"VLOOKUP($A36,datos!$A$4:$AD$52,23)","v":184},{"$f":"VLOOKUP($A36,datos!$A$4:$AD$52,24)","v":211},{"$f":"VLOOKUP($A36,datos!$A$4:$AD$52,25)","v":131},{"$f":"VLOOKUP($A36,datos!$A$4:$AD$52,26)","v":168},{"$f":"VLOOKUP($A36,datos!$A$4:$AD$52,27)","v":161},1012,{"$f":"VLOOKUP($A36,datos!$A$4:$AD$52,28)","v":24},{"$f":"VLOOKUP($A36,datos!$A$4:$AD$52,29)","v":3634},151.41666666666666,"30º",{"$error":"#N/A"}]
["J42",{"$f":"VLOOKUP($A37,datos!$A$4:$AD$52,2)","v":"FELIPE FUENTES F."},{"$f":"VLOOKUP($A37,datos!$A$4:$AD$52,3)","v":"Uruguay"},{"$f":"VLOOKUP($A37,datos!$A$4:$AD$52,4)","v":150},{"$f":"VLOOKUP($A37,datos!$A$4:$AD$52,5)","v":125},{"$f":"VLOOKUP($A37,datos!$A$4:$AD$52,6)","v":174},{"$f":"VLOOKUP($A37,datos!$A$4:$AD$52,7)","v":191},{"$f":"VLOOKUP($A37,datos!$A$4:$AD$52,8)","v":152},{"$f":"VLOOKUP($A37,datos!$A$4:$AD$52,9)","v":140},932,{"$f":"VLOOKUP($A37,datos!$A$4:$AD$52,10)","v":123},{"$f":"VLOOKUP($A37,datos!$A$4:$AD$52,11)","v":146},{"$f":"VLOOKUP($A37,datos!$A$4:$AD$52,12)","v":138},{"$f":"VLOOKUP($A37,datos!$A$4:$AD$52,13)","v":130},{"$f":"VLOOKUP($A37,datos!$A$4:$AD$52,14)","v":154},{"$f":"VLOOKUP($A37,datos!$A$4:$AD$52,15)","v":125},816,{"$f":"VLOOKUP($A37,datos!$A$4:$AD$52,16)","v":146},{"$f":"VLOOKUP($A37,datos!$A$4:$AD$52,17)","v":130},{"$f":"VLOOKUP($A37,datos!$A$4:$AD$52,18)","v":108},{"$f":"VLOOKUP($A37,datos!$A$4:$AD$52,19)","v":154},{"$f":"VLOOKUP($A37,datos!$A$4:$AD$52,20)","v":142},{"$f":"VLOOKUP($A37,datos!$A$4:$AD$52,21)","v":194},874,{"$f":"VLOOKUP($A37,datos!$A$4:$AD$52,22)","v":157},{"$f":"VLOOKUP($A37,datos!$A$4:$AD$52,23)","v":184},{"$f":"VLOOKUP($A37,datos!$A$4:$AD$52,24)","v":211},{"$f":"VLOOKUP($A37,datos!$A$4:$AD$52,25)","v":131},{"$f":"VLOOKUP($A37,datos!$A$4:$AD$52,26)","v":168},{"$f":"VLOOKUP($A37,datos!$A$4:$AD$52,27)","v":161},1012,{"$f":"VLOOKUP($A37,datos!$A$4:$AD$52,28)","v":24},{"$f":"VLOOKUP($A37,datos!$A$4:$AD$52,29)","v":3634},151.41666666666666,"31º",{"$error":"#N/A"}]
["J43",{"$f":"VLOOKUP($A38,datos!$A$4:$AD$52,2)","v":"FELIPE FUENTES F."},{"$f":"VLOOKUP($A38,datos!$A$4:$AD$52,3)","v":"Uruguay"},{"$f":"VLOOKUP($A38,datos!$A$4:$AD$52,4)","v":150},{"$f":"VLOOKUP($A38,datos!$A$4:$AD$52,5)","v":125},{"$f":"VLOOKUP($A38,datos!$A$4:$AD$52,6)","v":174},{"$f":"VLOOKUP($A38,datos!$A$4:$AD$52,7)","v":191},{"$f":"VLOOKUP($A38,datos!$A$4:$AD$52,8)","v":152},{"$f":"VLOOKUP($A38,datos!$A$4:$AD$52,9)","v":140},932,{"$f":"VLOOKUP($A38,datos!$A$4:$AD$52,10)","v":123},{"$f":"VLOOKUP($A38,datos!$A$4:$AD$52,11)","v":146},{"$f":"VLOOKUP($A38,datos!$A$4:$AD$52,12)","v":138},{"$f":"VLOOKUP($A38,datos!$A$4:$AD$52,13)","v":130},{"$f":"VLOOKUP($A38,datos!$A$4:$AD$52,14)","v":154},{"$f":"VLOOKUP($A38,datos!$A$4:$AD$52,15)","v":125},816,{"$f":"VLOOKUP($A38,datos!$A$4:$AD$52,16)","v":146},{"$f":"VLOOKUP($A38,datos!$A$4:$AD$52,17)","v":130},{"$f":"VLOOKUP($A38,datos!$A$4:$AD$52,18)","v":108},{"$f":"VLOOKUP($A38,datos!$A$4:$AD$52,19)","v":154},{"$f":"VLOOKUP($A38,datos!$A$4:$AD$52,20)","v":142},{"$f":"VLOOKUP($A38,datos!$A$4:$AD$52,21)","v":194},874,{"$f":"VLOOKUP($A38,datos!$A$4:$AD$52,22)","v":157},{"$f":"VLOOKUP($A38,datos!$A$4:$AD$52,23)","v":184},{"$f":"VLOOKUP($A38,datos!$A$4:$AD$52,24)","v":211},{"$f":"VLOOKUP($A38,datos!$A$4:$AD$52,25)","v":131},{"$f":"VLOOKUP($A38,datos!$A$4:$AD$52,26)","v":168},{"$f":"VLOOKUP($A38,datos!$A$4:$AD$52,27)","v":161},1012,{"$f":"VLOOKUP($A38,datos!$A$4:$AD$52,28)","v":24},{"$f":"VLOOKUP($A38,datos!$A$4:$AD$52,29)","v":3634},151.41666666666666,"32º",{"$error":"#N/A"}]
["J44",{"$f":"VLOOKUP($A39,datos!$A$4:$AD$52,2)","v":"FELIPE FUENTES F."},{"$f":"VLOOKUP($A39,datos!$A$4:$AD$52,3)","v":"Uruguay"},{"$f":"VLOOKUP($A39,datos!$A$4:$AD$52,4)","v":150},{"$f":"VLOOKUP($A39,datos!$A$4:$AD$52,5)","v":125},{"$f":"VLOOKUP($A39,datos!$A$4:$AD$52,6)","v":174},{"$f":"VLOOKUP($A39,datos!$A$4:$AD$52,7)","v":191},{"$f":"VLOOKUP($A39,datos!$A$4:$AD$52,8)","v":152},{"$f":"VLOOKUP($A39,datos!$A$4:$AD$52,9)","v":140},{"$f":"SUM(D39:I39)","v":932},{"$f":"VLOOKUP($A39,datos!$A$4:$AD$52,10)","v":123},{"$f":"VLOOKUP($A39,datos!$A$4:$AD$52,11)","v":146},{"$f":"VLOOKUP($A39,datos!$A$4:$AD$52,12)","v":138},{"$f":"VLOOKUP($A39,datos!$A$4:$AD$52,13)","v":130},{"$f":"VLOOKUP($A39,datos!$A$4:$AD$52,14)","v":154},{"$f":"VLOOKUP($A39,datos!$A$4:$AD$52,15)","v":125},{"$f":"SUM(K39:P39)","v":816},{"$f":"VLOOKUP($A39,datos!$A$4:$AD$52,16)","v":146},{"$f":"VLOOKUP($A39,datos!$A$4:$AD$52,17)","v":130},{"$f":"VLOOKUP($A39,datos!$A$4:$AD$52,18)","v":108},{"$f":"VLOOKUP($A39,datos!$A$4:$AD$52,19)","v":154},{"$f":"VLOOKUP($A39,datos!$A$4:$AD$52,20)","v":142},{"$f":"VLOOKUP($A39,datos!$A$4:$AD$52,21)","v":194},{"$f":"SUM(R39:W39)","v":874},{"$f":"VLOOKUP($A39,datos!$A$4:$AD$52,22)","v":157},{"$f":"VLOOKUP($A39,datos!$A$4:$AD$52,23)","v":184},{"$f":"VLOOKUP($A39,datos!$A$4:$AD$52,24)","v":211},{"$f":"VLOOKUP($A39,datos!$A$4:$AD$52,25)","v":131},{"$f":"VLOOKUP($A39,datos!$A$4:$AD$52,26)","v":168},{"$f":"VLOOKUP($A39,datos!$A$4:$AD$52,27)","v":161},{"$f":"SUM(Y39:AD39)","v":1012},{"$f":"VLOOKUP($A39,datos!$A$4:$AD$52,28)","v":24},{"$f":"VLOOKUP($A39,datos!$A$4:$AD$52,29)","v":3634},{"$f":"AG39/AF39","v":151.41666666666666},"33º",{"$error":"#N/A"}]
["J45",{"$f":"VLOOKUP($A40,datos!$A$4:$AD$52,2)","v":"FELIPE FUENTES F."},{"$f":"VLOOKUP($A40,datos!$A$4:$AD$52,3)","v":"Uruguay"},{"$f":"VLOOKUP($A40,datos!$A$4:$AD$52,4)","v":150},{"$f":"VLOOKUP($A40,datos!$A$4:$AD$52,5)","v":125},{"$f":"VLOOKUP($A40,datos!$A$4:$AD$52,6)","v":174},{"$f":"VLOOKUP($A40,datos!$A$4:$AD$52,7)","v":191},{"$f":"VLOOKUP($A40,datos!$A$4:$AD$52,8)","v":152},{"$f":"VLOOKUP($A40,datos!$A$4:$AD$52,9)","v":140},932,{"$f":"VLOOKUP($A40,datos!$A$4:$AD$52,10)","v":123},{"$f":"VLOOKUP($A40,datos!$A$4:$AD$52,11)","v":146},{"$f":"VLOOKUP($A40,datos!$A$4:$AD$52,12)","v":138},{"$f":"VLOOKUP($A40,datos!$A$4:$AD$52,13)","v":130},{"$f":"VLOOKUP($A40,datos!$A$4:$AD$52,14)","v":154},{"$f":"VLOOKUP($A40,datos!$A$4:$AD$52,15)","v":125},816,{"$f":"VLOOKUP($A40,datos!$A$4:$AD$52,16)","v":146},{"$f":"VLOOKUP($A40,datos!$A$4:$AD$52,17)","v":130},{"$f":"VLOOKUP($A40,datos!$A$4:$AD$52,18)","v":108},{"$f":"VLOOKUP($A40,datos!$A$4:$AD$52,19)","v":154},{"$f":"VLOOKUP($A40,datos!$A$4:$AD$52,20)","v":142},{"$f":"VLOOKUP($A40,datos!$A$4:$AD$52,21)","v":194},874,{"$f":"VLOOKUP($A40,datos!$A$4:$AD$52,22)","v":157},{"$f":"VLOOKUP($A40,datos!$A$4:$AD$52,23)","v":184},{"$f":"VLOOKUP($A40,datos!$A$4:$AD$52,24)","v":211},{"$f":"VLOOKUP($A40,datos!$A$4:$AD$52,25)","v":131},{"$f":"VLOOKUP($A40,datos!$A$4:$AD$52,26)","v":168},{"$f":"VLOOKUP($A40,datos!$A$4:$AD$52,27)","v":161},1012,{"$f":"VLOOKUP($A40,datos!$A$4:$AD$52,28)","v":24},{"$f":"VLOOKUP($A40,datos!$A$4:$AD$52,29)","v":3634},151.41666666666666,"34º",{"$error":"#N/A"}]
["J46",{"$f":"VLOOKUP($A41,datos!$A$4:$AD$52,2)","v":"FELIPE FUENTES F."},{"$f":"VLOOKUP($A41,datos!$A$4:$AD$52,3)","v":"Uruguay"},{"$f":"VLOOKUP($A41,datos!$A$4:$AD$52,4)","v":150},{"$f":"VLOOKUP($A41,datos!$A$4:$AD$52,5)","v":125},{"$f":"VLOOKUP($A41,datos!$A$4:$AD$52,6)","v":174},{"$f":"VLOOKUP($A41,datos!$A$4:$AD$52,7)","v":191},{"$f":"VLOOKUP($A41,datos!$A$4:$AD$52,8)","v":152},{"$f":"VLOOKUP($A41,datos!$A$4:$AD$52,9)","v":140},932,{"$f":"VLOOKUP($A41,datos!$A$4:$AD$52,10)","v":123},{"$f":"VLOOKUP($A41,datos!$A$4:$AD$52,11)","v":146},{"$f":"VLOOKUP($A41,datos!$A$4:$AD$52,12)","v":138},{"$f":"VLOOKUP($A41,datos!$A$4:$AD$52,13)","v":130},{"$f":"VLOOKUP($A41,datos!$A$4:$AD$52,14)","v":154},{"$f":"VLOOKUP($A41,datos!$A$4:$AD$52,15)","v":125},816,{"$f":"VLOOKUP($A41,datos!$A$4:$AD$52,16)","v":146},{"$f":"VLOOKUP($A41,datos!$A$4:$AD$52,17)","v":130},{"$f":"VLOOKUP($A41,datos!$A$4:$AD$52,18)","v":108},{"$f":"VLOOKUP($A41,datos!$A$4:$AD$52,19)","v":154},{"$f":"VLOOKUP($A41,datos!$A$4:$AD$52,20)","v":142},{"$f":"VLOOKUP($A41,datos!$A$4:$AD$52,21)","v":194},874,{"$f":"VLOOKUP($A41,datos!$A$4:$AD$52,22)","v":157},{"$f":"VLOOKUP($A41,datos!$A$4:$AD$52,23)","v":184},{"$f":"VLOOKUP($A41,datos!$A$4:$AD$52,24)","v":211},{"$f":"VLOOKUP($A41,datos!$A$4:$AD$52,25)","v":131},{"$f":"VLOOKUP($A41,datos!$A$4:$AD$52,26)","v":168},{"$f":"VLOOKUP($A41,datos!$A$4:$AD$52,27)","v":161},1012,{"$f":"VLOOKUP($A41,datos!$A$4:$AD$52,28)","v":24},{"$f":"VLOOKUP($A41,datos!$A$4:$AD$52,29)","v":3634},151.41666666666666,"35º",{"$error":"#N/A"}]
["J47",{"$f":"VLOOKUP($A42,datos!$A$4:$AD$52,2)","v":"FELIPE FUENTES F."},{"$f":"VLOOKUP($A42,datos!$A$4:$AD$52,3)","v":"Uruguay"},{"$f":"VLOOKUP($A42,datos!$A$4:$AD$52,4)","v":150},{"$f":"VLOOKUP($A42,datos!$A$4:$AD$52,5)","v":125},{"$f":"VLOOKUP($A42,datos!$A$4:$AD$52,6)","v":174},{"$f":"VLOOKUP($A42,datos!$A$4:$AD$52,7)","v":191},{"$f":"VLOOKUP($A42,datos!$A$4:$AD$52,8)","v":152},{"$f":"VLOOKUP($A42,datos!$A$4:$AD$52,9)","v":140},932,{"$f":"VLOOKUP($A42,datos!$A$4:$AD$52,10)","v":123},{"$f":"VLOOKUP($A42,datos!$A$4:$AD$52,11)","v":146},{"$f":"VLOOKUP($A42,datos!$A$4:$AD$52,12)","v":138},{"$f":"VLOOKUP($A42,datos!$A$4:$AD$52,13)","v":130},{"$f":"VLOOKUP($A42,datos!$A$4:$AD$52,14)","v":154},{"$f":"VLOOKUP($A42,datos!$A$4:$AD$52,15)","v":125},816,{"$f":"VLOOKUP($A42,datos!$A$4:$AD$52,16)","v":146},{"$f":"VLOOKUP($A42,datos!$A$4:$AD$52,17)","v":130},{"$f":"VLOOKUP($A42,datos!$A$4:$AD$52,18)","v":108},{"$f":"VLOOKUP($A42,datos!$A$4:$AD$52,19)","v":154},{"$f":"VLOOKUP($A42,datos!$A$4:$AD$52,20)","v":142},{"$f":"VLOOKUP($A42,datos!$A$4:$AD$52,21)","v":194},874,{"$f":"VLOOKUP($A42,datos!$A$4:$AD$52,22)","v":157},{"$f":"VLOOKUP($A42,datos!$A$4:$AD$52,23)","v":184},{"$f":"VLOOKUP($A42,datos!$A$4:$AD$52,24)","v":211},{"$f":"VLOOKUP($A42,datos!$A$4:$AD$52,25)","v":131},{"$f":"VLOOKUP($A42,datos!$A$4:$AD$52,26)","v":168},{"$f":"VLOOKUP($A42,datos!$A$4:$AD$52,27)","v":161},1012,{"$f":"VLOOKUP($A42,datos!$A$4:$AD$52,28)","v":24},{"$f":"VLOOKUP($A42,datos!$A$4:$AD$52,29)","v":3634},151.41666666666666,"36º",{"$error":"#N/A"}]
["J48",{"$f":"VLOOKUP($A43,datos!$A$4:$AD$52,2)","v":"FELIPE FUENTES F."},{"$f":"VLOOKUP($A43,datos!$A$4:$AD$52,3)","v":"Uruguay"},{"$f":"VLOOKUP($A43,datos!$A$4:$AD$52,4)","v":150},{"$f":"VLOOKUP($A43,datos!$A$4:$AD$52,5)","v":125},{"$f":"VLOOKUP($A43,datos!$A$4:$AD$52,6)","v":174},{"$f":"VLOOKUP($A43,datos!$A$4:$AD$52,7)","v":191},{"$f":"VLOOKUP($A43,datos!$A$4:$AD$52,8)","v":152},{"$f":"VLOOKUP($A43,datos!$A$4:$AD$52,9)","v":140},932,{"$f":"VLOOKUP($A43,datos!$A$4:$AD$52,10)","v":123},{"$f":"VLOOKUP($A43,datos!$A$4:$AD$52,11)","v":146},{"$f":"VLOOKUP($A43,datos!$A$4:$AD$52,12)","v":138},{"$f":"VLOOKUP($A43,datos!$A$4:$AD$52,13)","v":130},{"$f":"VLOOKUP($A43,datos!$A$4:$AD$52,14)","v":154},{"$f":"VLOOKUP($A43,datos!$A$4:$AD$52,15)","v":125},816,{"$f":"VLOOKUP($A43,datos!$A$4:$AD$52,16)","v":146},{"$f":"VLOOKUP($A43,datos!$A$4:$AD$52,17)","v":130},{"$f":"VLOOKUP($A43,datos!$A$4:$AD$52,18)","v":108},{"$f":"VLOOKUP($A43,datos!$A$4:$AD$52,19)","v":154},{"$f":"VLOOKUP($A43,datos!$A$4:$AD$52,20)","v":142},{"$f":"VLOOKUP($A43,datos!$A$4:$AD$52,21)","v":194},874,{"$f":"VLOOKUP($A43,datos!$A$4:$AD$52,22)","v":157},{"$f":"VLOOKUP($A43,datos!$A$4:$AD$52,23)","v":184},{"$f":"VLOOKUP($A43,datos!$A$4:$AD$52,24)","v":211},{"$f":"VLOOKUP($A43,datos!$A$4:$AD$52,25)","v":131},{"$f":"VLOOKUP($A43,datos!$A$4:$AD$52,26)","v":168},{"$f":"VLOOKUP($A43,datos!$A$4:$AD$52,27)","v":161},1012,{"$f":"VLOOKUP($A43,datos!$A$4:$AD$52,28)","v":24},{"$f":"VLOOKUP($A43,datos!$A$4:$AD$52,29)","v":3634},151.41666666666666,"37º",{"$error":"#N/A"}]
["C12",{"$f":"VLOOKUP($A44,datos!$A$4:$AD$52,2)","v":{"$error":"#N/A"}},{"$f":"VLOOKUP($A44,datos!$A$4:$AD$52,3)","v":{"$error":"#N/A"}},{"$f":"VLOOKUP($A44,datos!$A$4:$AD$52,4)","v":{"$error":"#N/A"}},{"$f":"VLOOKUP($A44,datos!$A$4:$AD$52,5)","v":{"$error":"#N/A"}},{"$f":"VLOOKUP($A44,datos!$A$4:$AD$52,6)","v":{"$error":"#N/A"}},{"$f":"VLOOKUP($A44,datos!$A$4:$AD$52,7)","v":{"$error":"#N/A"}},{"$f":"VLOOKUP($A44,datos!$A$4:$AD$52,8)","v":{"$error":"#N/A"}},{"$f":"VLOOKUP($A44,datos!$A$4:$AD$52,9)","v":{"$error":"#N/A"}},{"$error":"#N/A"},{"$f":"VLOOKUP($A44,datos!$A$4:$AD$52,10)","v":{"$error":"#N/A"}},{"$f":"VLOOKUP($A44,datos!$A$4:$AD$52,11)","v":{"$error":"#N/A"}},{"$f":"VLOOKUP($A44,datos!$A$4:$AD$52,12)","v":{"$error":"#N/A"}},{"$f":"VLOOKUP($A44,datos!$A$4:$AD$52,13)","v":{"$error":"#N/A"}},{"$f":"VLOOKUP($A44,datos!$A$4:$AD$52,14)","v":{"$error":"#N/A"}},{"$f":"VLOOKUP($A44,datos!$A$4:$AD$52,15)","v":{"$error":"#N/A"}},{"$error":"#N/A"},{"$f":"VLOOKUP($A44,datos!$A$4:$AD$52,16)","v":{"$error":"#N/A"}},{"$f":"VLOOKUP($A44,datos!$A$4:$AD$52,17)","v":{"$error":"#N/A"}},{"$f":"VLOOKUP($A44,datos!$A$4:$AD$52,18)","v":{"$error":"#N/A"}},{"$f":"VLOOKUP($A44,datos!$A$4:$AD$52,19)","v":{"$error":"#N/A"}},{"$f":"VLOOKUP($A44,datos!$A$4:$AD$52,20)","v":{"$error":"#N/A"}},{"$f":"VLOOKUP($A44,datos!$A$4:$AD$52,21)","v":{"$error":"#N/A"}},{"$error":"#N/A"},{"$f":"VLOOKUP($A44,datos!$A$4:$AD$52,22)","v":{"$error":"#N/A"}},{"$f":"VLOOKUP($A44,datos!$A$4:$AD$52,23)","v":{"$error":"#N/A"}},{"$f":"VLOOKUP($A44,datos!$A$4:$AD$52,24)","v":{"$error":"#N/A"}},{"$f":"VLOOKUP($A44,datos!$A$4:$AD$52,25)","v":{"$error":"#N/A"}},{"$f":"VLOOKUP($A44,datos!$A$4:$AD$52,26)","v":{"$error":"#N/A"}},{"$f":"VLOOKUP($A44,datos!$A$4:$AD$52,27)","v":{"$error":"#N/A"}},{"$error":"#N/A"},{"$f":"VLOOKUP($A44,datos!$A$4:$AD$52,28)","v":{"$error":"#N/A"}},{"$f":"VLOOKUP($A44,datos!$A$4:$AD$52,29)","v":{"$error":"#N/A"}},{"$error":"#N/A"},"38º",{"$error":"#N/A"}]
["C06",{"$f":"VLOOKUP($A45,datos!$A$4:$AD$52,2)","v":{"$error":"#N/A"}},{"$f":"VLOOKUP($A45,datos!$A$4:$AD$52,3)","v":{"$error":"#N/A"}},{"$f":"VLOOKUP($A45,datos!$A$4:$AD$52,4)","v":{"$error":"#N/A"}},{"$f":"VLOOKUP($A45,datos!$A$4:$AD$52,5)","v":{"$error":"#N/A"}},{"$f":"VLOOKUP($A45,datos!$A$4:$AD$52,6)","v":{"$error":"#N/A"}},{"$f":"VLOOKUP($A45,datos!$A$4:$AD$52,7)","v":{"$error":"#N/A"}},{"$f":"VLOOKUP($A45,datos!$A$4:$AD$52,8)","v":{"$error":"#N/A"}},{"$f":"VLOOKUP($A45,datos!$A$4:$AD$52,9)","v":{"$error":"#N/A"}},{"$error":"#N/A"},{"$f":"VLOOKUP($A45,datos!$A$4:$AD$52,10)","v":{"$error":"#N/A"}},{"$f":"VLOOKUP($A45,datos!$A$4:$AD$52,11)","v":{"$error":"#N/A"}},{"$f":"VLOOKUP($A45,datos!$A$4:$AD$52,12)","v":{"$error":"#N/A"}},{"$f":"VLOOKUP($A45,datos!$A$4:$AD$52,13)","v":{"$error":"#N/A"}},{"$f":"VLOOKUP($A45,datos!$A$4:$AD$52,14)","v":{"$error":"#N/A"}},{"$f":"VLOOKUP($A45,datos!$A$4:$AD$52,15)","v":{"$error":"#N/A"}},{"$error":"#N/A"},{"$f":"VLOOKUP($A45,datos!$A$4:$AD$52,16)","v":{"$error":"#N/A"}},{"$f":"VLOOKUP($A45,datos!$A$4:$AD$52,17)","v":{"$error":"#N/A"}},{"$f":"VLOOKUP($A45,datos!$A$4:$AD$52,18)","v":{"$error":"#N/A"}},{"$f":"VLOOKUP($A45,datos!$A$4:$AD$52,19)","v":{"$error":"#N/A"}},{"$f":"VLOOKUP($A45,datos!$A$4:$AD$52,20)","v":{"$error":"#N/A"}},{"$f":"VLOOKUP($A45,datos!$A$4:$AD$52,21)","v":{"$error":"#N/A"}},{"$error":"#N/A"},{"$f":"VLOOKUP($A45,datos!$A$4:$AD$52,22)","v":{"$error":"#N/A"}},{"$f":"VLOOKUP($A45,datos!$A$4:$AD$52,23)","v":{"$error":"#N/A"}},{"$f":"VLOOKUP($A45,datos!$A$4:$AD$52,24)","v":{"$error":"#N/A"}},{"$f":"VLOOKUP($A45,datos!$A$4:$AD$52,25)","v":{"$error":"#N/A"}},{"$f":"VLOOKUP($A45,datos!$A$4:$AD$52,26)","v":{"$error":"#N/A"}},{"$f":"VLOOKUP($A45,datos!$A$4:$AD$52,27)","v":{"$error":"#N/A"}},{"$error":"#N/A"},{"$f":"VLOOKUP($A45,datos!$A$4:$AD$52,28)","v":{"$error":"#N/A"}},{"$f":"VLOOKUP($A45,datos!$A$4:$AD$52,29)","v":{"$error":"#N/A"}},{"$error":"#N/A"},"39º",{"$error":"#N/A"}]
["C47",{"$f":"VLOOKUP($A46,datos!$A$4:$AD$52,2)","v":{"$error":"#N/A"}},{"$f":"VLOOKUP($A46,datos!$A$4:$AD$52,3)","v":{"$error":"#N/A"}},{"$f":"VLOOKUP($A46,datos!$A$4:$AD$52,4)","v":{"$error":"#N/A"}},{"$f":"VLOOKUP($A46,datos!$A$4:$AD$52,5)","v":{"$error":"#N/A"}},{"$f":"VLOOKUP($A46,datos!$A$4:$AD$52,6)","v":{"$error":"#N/A"}},{"$f":"VLOOKUP($A46,datos!$A$4:$AD$52,7)","v":{"$error":"#N/A"}},{"$f":"VLOOKUP($A46,datos!$A$4:$AD$52,8)","v":{"$error":"#N/A"}},{"$f":"VLOOKUP($A46,datos!$A$4:$AD$52,9)","v":{"$error":"#N/A"}},{"$error":"#N/A"},{"$f":"VLOOKUP($A46,datos!$A$4:$AD$52,10)","v":{"$error":"#N/A"}},{"$f":"VLOOKUP($A46,datos!$A$4:$AD$52,11)","v":{"$error":"#N/A"}},{"$f":"VLOOKUP($A46,datos!$A$4:$AD$52,12)","v":{"$error":"#N/A"}},{"$f":"VLOOKUP($A46,datos!$A$4:$AD$52,13)","v":{"$error":"#N/A"}},{"$f":"VLOOKUP($A46,datos!$A$4:$AD$52,14)","v":{"$error":"#N/A"}},{"$f":"VLOOKUP($A46,datos!$A$4:$AD$52,15)","v":{"$error":"#N/A"}},{"$error":"#N/A"},{"$f":"VLOOKUP($A46,datos!$A$4:$AD$52,16)","v":{"$error":"#N/A"}},{"$f":"VLOOKUP($A46,datos!$A$4:$AD$52,17)","v":{"$error":"#N/A"}},{"$f":"VLOOKUP($A46,datos!$A$4:$AD$52,18)","v":{"$error":"#N/A"}},{"$f":"VLOOKUP($A46,datos!$A$4:$AD$52,19)","v":{"$error":"#N/A"}},{"$f":"VLOOKUP($A46,datos!$A$4:$AD$52,20)","v":{"$error":"#N/A"}},{"$f":"VLOOKUP($A46,datos!$A$4:$AD$52,21)","v":{"$error":"#N/A"}},{"$error":"#N/A"},{"$f":"VLOOKUP($A46,datos!$A$4:$AD$52,22)","v":{"$error":"#N/A"}},{"$f":"VLOOKUP($A46,datos!$A$4:$AD$52,23)","v":{"$error":"#N/A"}},{"$f":"VLOOKUP($A46,datos!$A$4:$AD$52,24)","v":{"$error":"#N/A"}},{"$f":"VLOOKUP($A46,datos!$A$4:$AD$52,25)","v":{"$error":"#N/A"}},{"$f":"VLOOKUP($A46,datos!$A$4:$AD$52,26)","v":{"$error":"#N/A"}},{"$f":"VLOOKUP($A46,datos!$A$4:$AD$52,27)","v":{"$error":"#N/A"}},{"$error":"#N/A"},{"$f":"VLOOKUP($A46,datos!$A$4:$AD$52,28)","v":{"$error":"#N/A"}},{"$f":"VLOOKUP($A46,datos!$A$4:$AD$52,29)","v":{"$error":"#N/A"}},{"$error":"#N/A"},"40º",{"$error":"#N/A"}]
["C11",{"$f":"VLOOKUP($A47,datos!$A$4:$AD$52,2)","v":{"$error":"#N/A"}},{"$f":"VLOOKUP($A47,datos!$A$4:$AD$52,3)","v":{"$error":"#N/A"}},{"$f":"VLOOKUP($A47,datos!$A$4:$AD$52,4)","v":{"$error":"#N/A"}},{"$f":"VLOOKUP($A47,datos!$A$4:$AD$52,5)","v":{"$error":"#N/A"}},{"$f":"VLOOKUP($A47,datos!$A$4:$AD$52,6)","v":{"$error":"#N/A"}},{"$f":"VLOOKUP($A47,datos!$A$4:$AD$52,7)","v":{"$error":"#N/A"}},{"$f":"VLOOKUP($A47,datos!$A$4:$AD$52,8)","v":{"$error":"#N/A"}},{"$f":"VLOOKUP($A47,datos!$A$4:$AD$52,9)","v":{"$error":"#N/A"}},{"$error":"#N/A"},{"$f":"VLOOKUP($A47,datos!$A$4:$AD$52,10)","v":{"$error":"#N/A"}},{"$f":"VLOOKUP($A47,datos!$A$4:$AD$52,11)","v":{"$error":"#N/A"}},{"$f":"VLOOKUP($A47,datos!$A$4:$AD$52,12)","v":{"$error":"#N/A"}},{"$f":"VLOOKUP($A47,datos!$A$4:$AD$52,13)","v":{"$error":"#N/A"}},{"$f":"VLOOKUP($A47,datos!$A$4:$AD$52,14)","v":{"$error":"#N/A"}},{"$f":"VLOOKUP($A47,datos!$A$4:$AD$52,15)","v":{"$error":"#N/A"}},{"$error":"#N/A"},{"$f":"VLOOKUP($A47,datos!$A$4:$AD$52,16)","v":{"$error":"#N/A"}},{"$f":"VLOOKUP($A47,datos!$A$4:$AD$52,17)","v":{"$error":"#N/A"}},{"$f":"VLOOKUP($A47,datos!$A$4:$AD$52,18)","v":{"$error":"#N/A"}},{"$f":"VLOOKUP($A47,datos!$A$4:$AD$52,19)","v":{"$error":"#N/A"}},{"$f":"VLOOKUP($A47,datos!$A$4:$AD$52,20)","v":{"$error":"#N/A"}},{"$f":"VLOOKUP($A47,datos!$A$4:$AD$52,21)","v":{"$error":"#N/A"}},{"$error":"#N/A"},{"$f":"VLOOKUP($A47,datos!$A$4:$AD$52,22)","v":{"$error":"#N/A"}},{"$f":"VLOOKUP($A47,datos!$A$4:$AD$52,23)","v":{"$error":"#N/A"}},{"$f":"VLOOKUP($A47,datos!$A$4:$AD$52,24)","v":{"$error":"#N/A"}},{"$f":"VLOOKUP($A47,datos!$A$4:$AD$52,25)","v":{"$error":"#N/A"}},{"$f":"VLOOKUP($A47,datos!$A$4:$AD$52,26)","v":{"$error":"#N/A"}},{"$f":"VLOOKUP($A47,datos!$A$4:$AD$52,27)","v":{"$error":"#N/A"}},{"$error":"#N/A"},{"$f":"VLOOKUP($A47,datos!$A$4:$AD$52,28)","v":{"$error":"#N/A"}},{"$f":"VLOOKUP($A47,datos!$A$4:$AD$52,29)","v":{"$error":"#N/A"}},{"$error":"#N/A"},"41º",{"$error":"#N/A"}]
["C17",{"$f":"VLOOKUP($A48,datos!$A$4:$AD$52,2)","v":{"$error":"#N/A"}},{"$f":"VLOOKUP($A48,datos!$A$4:$AD$52,3)","v":{"$error":"#N/A"}},{"$f":"VLOOKUP($A48,datos!$A$4:$AD$52,4)","v":{"$error":"#N/A"}},{"$f":"VLOOKUP($A48,datos!$A$4:$AD$52,5)","v":{"$error":"#N/A"}},{"$f":"VLOOKUP($A48,datos!$A$4:$AD$52,6)","v":{"$error":"#N/A"}},{"$f":"VLOOKUP($A48,datos!$A$4:$AD$52,7)","v":{"$error":"#N/A"}},{"$f":"VLOOKUP($A48,datos!$A$4:$AD$52,8)","v":{"$error":"#N/A"}},{"$f":"VLOOKUP($A48,datos!$A$4:$AD$52,9)","v":{"$error":"#N/A"}},{"$error":"#N/A"},{"$f":"VLOOKUP($A48,datos!$A$4:$AD$52,10)","v":{"$error":"#N/A"}},{"$f":"VLOOKUP($A48,datos!$A$4:$AD$52,11)","v":{"$error":"#N/A"}},{"$f":"VLOOKUP($A48,datos!$A$4:$AD$52,12)","v":{"$error":"#N/A"}},{"$f":"VLOOKUP($A48,datos!$A$4:$AD$52,13)","v":{"$error":"#N/A"}},{"$f":"VLOOKUP($A48,datos!$A$4:$AD$52,14)","v":{"$error":"#N/A"}},{"$f":"VLOOKUP($A48,datos!$A$4:$AD$52,15)","v":{"$error":"#N/A"}},{"$error":"#N/A"},{"$f":"VLOOKUP($A48,datos!$A$4:$AD$52,16)","v":{"$error":"#N/A"}},{"$f":"VLOOKUP($A48,datos!$A$4:$AD$52,17)","v":{"$error":"#N/A"}},{"$f":"VLOOKUP($A48,datos!$A$4:$AD$52,18)","v":{"$error":"#N/A"}},{"$f":"VLOOKUP($A48,datos!$A$4:$AD$52,19)","v":{"$error":"#N/A"}},{"$f":"VLOOKUP($A48,datos!$A$4:$AD$52,20)","v":{"$error":"#N/A"}},{"$f":"VLOOKUP($A48,datos!$A$4:$AD$52,21)","v":{"$error":"#N/A"}},{"$error":"#N/A"},{"$f":"VLOOKUP($A48,datos!$A$4:$AD$52,22)","v":{"$error":"#N/A"}},{"$f":"VLOOKUP($A48,datos!$A$4:$AD$52,23)","v":{"$error":"#N/A"}},{"$f":"VLOOKUP($A48,datos!$A$4:$AD$52,24)","v":{"$error":"#N/A"}},{"$f":"VLOOKUP($A48,datos!$A$4:$AD$52,25)","v":{"$error":"#N/A"}},{"$f":"VLOOKUP($A48,datos!$A$4:$AD$52,26)","v":{"$error":"#N/A"}},{"$f":"VLOOKUP($A48,datos!$A$4:$AD$52,27)","v":{"$error":"#N/A"}},{"$error":"#N/A"},{"$f":"VLOOKUP($A48,datos!$A$4:$AD$52,28)","v":{"$error":"#N/A"}},{"$f":"VLOOKUP($A48,datos!$A$4:$AD$52,29)","v":{"$error":"#N/A"}},{"$error":"#N/A"},"42º",{"$error":"#N/A"}]
["C21",{"$f":"VLOOKUP($A49,datos!$A$4:$AD$52,2)","v":{"$error":"#N/A"}},{"$f":"VLOOKUP($A49,datos!$A$4:$AD$52,3)","v":{"$error":"#N/A"}},{"$f":"VLOOKUP($A49,datos!$A$4:$AD$52,4)","v":{"$error":"#N/A"}},{"$f":"VLOOKUP($A49,datos!$A$4:$AD$52,5)","v":{"$error":"#N/A"}},{"$f":"VLOOKUP($A49,datos!$A$4:$AD$52,6)","v":{"$error":"#N/A"}},{"$f":"VLOOKUP($A49,datos!$A$4:$AD$52,7)","v":{"$error":"#N/A"}},{"$f":"VLOOKUP($A49,datos!$A$4:$AD$52,8)","v":{"$error":"#N/A"}},{"$f":"VLOOKUP($A49,datos!$A$4:$AD$52,9)","v":{"$error":"#N/A"}},{"$error":"#N/A"},{"$f":"VLOOKUP($A49,datos!$A$4:$AD$52,10)","v":{"$error":"#N/A"}},{"$f":"VLOOKUP($A49,datos!$A$4:$AD$52,11)","v":{"$error":"#N/A"}},{"$f":"VLOOKUP($A49,datos!$A$4:$AD$52,12)","v":{"$error":"#N/A"}},{"$f":"VLOOKUP($A49,datos!$A$4:$AD$52,13)","v":{"$error":"#N/A"}},{"$f":"VLOOKUP($A49,datos!$A$4:$AD$52,14)","v":{"$error":"#N/A"}},{"$f":"VLOOKUP($A49,datos!$A$4:$AD$52,15)","v":{"$error":"#N/A"}},{"$error":"#N/A"},{"$f":"VLOOKUP($A49,datos!$A$4:$AD$52,16)","v":{"$error":"#N/A"}},{"$f":"VLOOKUP($A49,datos!$A$4:$AD$52,17)","v":{"$error":"#N/A"}},{"$f":"VLOOKUP($A49,datos!$A$4:$AD$52,18)","v":{"$error":"#N/A"}},{"$f":"VLOOKUP($A49,datos!$A$4:$AD$52,19)","v":{"$error":"#N/A"}},{"$f":"VLOOKUP($A49,datos!$A$4:$AD$52,20)","v":{"$error":"#N/A"}},{"$f":"VLOOKUP($A49,datos!$A$4:$AD$52,21)","v":{"$error":"#N/A"}},{"$error":"#N/A"},{"$f":"VLOOKUP($A49,datos!$A$4:$AD$52,22)","v":{"$error":"#N/A"}},{"$f":"VLOOKUP($A49,datos!$A$4:$AD$52,23)","v":{"$error":"#N/A"}},{"$f":"VLOOKUP($A49,datos!$A$4:$AD$52,24)","v":{"$error":"#N/A"}},{"$f":"VLOOKUP($A49,datos!$A$4:$AD$52,25)","v":{"$error":"#N/A"}},{"$f":"VLOOKUP($A49,datos!$A$4:$AD$52,26)","v":{"$error":"#N/A"}},{"$f":"VLOOKUP($A49,datos!$A$4:$AD$52,27)","v":{"$error":"#N/A"}},{"$error":"#N/A"},{"$f":"VLOOKUP($A49,datos!$A$4:$AD$52,28)","v":{"$error":"#N/A"}},{"$f":"VLOOKUP($A49,datos!$A$4:$AD$52,29)","v":{"$error":"#N/A"}},{"$error":"#N/A"},"43º",{"$error":"#N/A"}]
["C45",{"$f":"VLOOKUP($A50,datos!$A$4:$AD$52,2)","v":{"$error":"#N/A"}},{"$f":"VLOOKUP($A50,datos!$A$4:$AD$52,3)","v":{"$error":"#N/A"}},{"$f":"VLOOKUP($A50,datos!$A$4:$AD$52,4)","v":{"$error":"#N/A"}},{"$f":"VLOOKUP($A50,datos!$A$4:$AD$52,5)","v":{"$error":"#N/A"}},{"$f":"VLOOKUP($A50,datos!$A$4:$AD$52,6)","v":{"$error":"#N/A"}},{"$f":"VLOOKUP($A50,datos!$A$4:$AD$52,7)","v":{"$error":"#N/A"}},{"$f":"VLOOKUP($A50,datos!$A$4:$AD$52,8)","v":{"$error":"#N/A"}},{"$f":"VLOOKUP($A50,datos!$A$4:$AD$52,9)","v":{"$error":"#N/A"}},{"$error":"#N/A"},{"$f":"VLOOKUP($A50,datos!$A$4:$AD$52,10)","v":{"$error":"#N/A"}},{"$f":"VLOOKUP($A50,datos!$A$4:$AD$52,11)","v":{"$error":"#N/A"}},{"$f":"VLOOKUP($A50,datos!$A$4:$AD$52,12)","v":{"$error":"#N/A"}},{"$f":"VLOOKUP($A50,datos!$A$4:$AD$52,13)","v":{"$error":"#N/A"}},{"$f":"VLOOKUP($A50,datos!$A$4:$AD$52,14)","v":{"$error":"#N/A"}},{"$f":"VLOOKUP($A50,datos!$A$4:$AD$52,15)","v":{"$error":"#N/A"}},{"$error":"#N/A"},{"$f":"VLOOKUP($A50,datos!$A$4:$AD$52,16)","v":{"$error":"#N/A"}},{"$f":"VLOOKUP($A50,datos!$A$4:$AD$52,17)","v":{"$error":"#N/A"}},{"$f":"VLOOKUP($A50,datos!$A$4:$AD$52,18)","v":{"$error":"#N/A"}},{"$f":"VLOOKUP($A50,datos!$A$4:$AD$52,19)","v":{"$error":"#N/A"}},{"$f":"VLOOKUP($A50,datos!$A$4:$AD$52,20)","v":{"$error":"#N/A"}},{"$f":"VLOOKUP($A50,datos!$A$4:$AD$52,21)","v":{"$error":"#N/A"}},{"$error":"#N/A"},{"$f":"VLOOKUP($A50,datos!$A$4:$AD$52,22)","v":{"$error":"#N/A"}},{"$f":"VLOOKUP($A50,datos!$A$4:$AD$52,23)","v":{"$error":"#N/A"}},{"$f":"VLOOKUP($A50,datos!$A$4:$AD$52,24)","v":{"$error":"#N/A"}},{"$f":"VLOOKUP($A50,datos!$A$4:$AD$52,25)","v":{"$error":"#N/A"}},{"$f":"VLOOKUP($A50,datos!$A$4:$AD$52,26)","v":{"$error":"#N/A"}},{"$f":"VLOOKUP($A50,datos!$A$4:$AD$52,27)","v":{"$error":"#N/A"}},{"$error":"#N/A"},{"$f":"VLOOKUP($A50,datos!$A$4:$AD$52,28)","v":{"$error":"#N/A"}},{"$f":"VLOOKUP($A50,datos!$A$4:$AD$52,29)","v":{"$error":"#N/A"}},{"$error":"#N/A"},"44º",{"$error":"#N/A"}]
["C09",{"$f":"VLOOKUP($A51,datos!$A$4:$AD$52,2)","v":{"$error":"#N/A"}},{"$f":"VLOOKUP($A51,datos!$A$4:$AD$52,3)","v":{"$error":"#N/A"}},{"$f":"VLOOKUP($A51,datos!$A$4:$AD$52,4)","v":{"$error":"#N/A"}},{"$f":"VLOOKUP($A51,datos!$A$4:$AD$52,5)","v":{"$error":"#N/A"}},{"$f":"VLOOKUP($A51,datos!$A$4:$AD$52,6)","v":{"$error":"#N/A"}},{"$f":"VLOOKUP($A51,datos!$A$4:$AD$52,7)","v":{"$error":"#N/A"}},{"$f":"VLOOKUP($A51,datos!$A$4:$AD$52,8)","v":{"$error":"#N/A"}},{"$f":"VLOOKUP($A51,datos!$A$4:$AD$52,9)","v":{"$error":"#N/A"}},{"$error":"#N/A"},{"$f":"VLOOKUP($A51,datos!$A$4:$AD$52,10)","v":{"$error":"#N/A"}},{"$f":"VLOOKUP($A51,datos!$A$4:$AD$52,11)","v":{"$error":"#N/A"}},{"$f":"VLOOKUP($A51,datos!$A$4:$AD$52,12)","v":{"$error":"#N/A"}},{"$f":"VLOOKUP($A51,datos!$A$4:$AD$52,13)","v":{"$error":"#N/A"}},{"$f":"VLOOKUP($A51,datos!$A$4:$AD$52,14)","v":{"$error":"#N/A"}},{"$f":"VLOOKUP($A51,datos!$A$4:$AD$52,15)","v":{"$error":"#N/A"}},{"$error":"#N/A"},{"$f":"VLOOKUP($A51,datos!$A$4:$AD$52,16)","v":{"$error":"#N/A"}},{"$f":"VLOOKUP($A51,datos!$A$4:$AD$52,17)","v":{"$error":"#N/A"}},{"$f":"VLOOKUP($A51,datos!$A$4:$AD$52,18)","v":{"$error":"#N/A"}},{"$f":"VLOOKUP($A51,datos!$A$4:$AD$52,19)","v":{"$error":"#N/A"}},{"$f":"VLOOKUP($A51,datos!$A$4:$AD$52,20)","v":{"$error":"#N/A"}},{"$f":"VLOOKUP($A51,datos!$A$4:$AD$52,21)","v":{"$error":"#N/A"}},{"$error":"#N/A"},{"$f":"VLOOKUP($A51,datos!$A$4:$AD$52,22)","v":{"$error":"#N/A"}},{"$f":"VLOOKUP($A51,datos!$A$4:$AD$52,23)","v":{"$error":"#N/A"}},{"$f":"VLOOKUP($A51,datos!$A$4:$AD$52,24)","v":{"$error":"#N/A"}},{"$f":"VLOOKUP($A51,datos!$A$4:$AD$52,25)","v":{"$error":"#N/A"}},{"$f":"VLOOKUP($A51,datos!$A$4:$AD$52,26)","v":{"$error":"#N/A"}},{"$f":"VLOOKUP($A51,datos!$A$4:$AD$52,27)","v":{"$error":"#N/A"}},{"$error":"#N/A"},{"$f":"VLOOKUP($A51,datos!$A$4:$AD$52,28)","v":{"$error":"#N/A"}},{"$f":"VLOOKUP($A51,datos!$A$4:$AD$52,29)","v":{"$error":"#N/A"}},{"$error":"#N/A"},"45º",{"$error":"#N/A"}]
["C18",{"$f":"VLOOKUP($A52,datos!$A$4:$AD$52,2)","v":{"$error":"#N/A"}},{"$f":"VLOOKUP($A52,datos!$A$4:$AD$52,3)","v":{"$error":"#N/A"}},{"$f":"VLOOKUP($A52,datos!$A$4:$AD$52,4)","v":{"$error":"#N/A"}},{"$f":"VLOOKUP($A52,datos!$A$4:$AD$52,5)","v":{"$error":"#N/A"}},{"$f":"VLOOKUP($A52,datos!$A$4:$AD$52,6)","v":{"$error":"#N/A"}},{"$f":"VLOOKUP($A52,datos!$A$4:$AD$52,7)","v":{"$error":"#N/A"}},{"$f":"VLOOKUP($A52,datos!$A$4:$AD$52,8)","v":{"$error":"#N/A"}},{"$f":"VLOOKUP($A52,datos!$A$4:$AD$52,9)","v":{"$error":"#N/A"}},{"$error":"#N/A"},{"$f":"VLOOKUP($A52,datos!$A$4:$AD$52,10)","v":{"$error":"#N/A"}},{"$f":"VLOOKUP($A52,datos!$A$4:$AD$52,11)","v":{"$error":"#N/A"}},{"$f":"VLOOKUP($A52,datos!$A$4:$AD$52,12)","v":{"$error":"#N/A"}},{"$f":"VLOOKUP($A52,datos!$A$4:$AD$52,13)","v":{"$error":"#N/A"}},{"$f":"VLOOKUP($A52,datos!$A$4:$AD$52,14)","v":{"$error":"#N/A"}},{"$f":"VLOOKUP($A52,datos!$A$4:$AD$52,15)","v":{"$error":"#N/A"}},{"$error":"#N/A"},{"$f":"VLOOKUP($A52,datos!$A$4:$AD$52,16)","v":{"$error":"#N/A"}},{"$f":"VLOOKUP($A52,datos!$A$4:$AD$52,17)","v":{"$error":"#N/A"}},{"$f":"VLOOKUP($A52,datos!$A$4:$AD$52,18)","v":{"$error":"#N/A"}},{"$f":"VLOOKUP($A52,datos!$A$4:$AD$52,19)","v":{"$error":"#N/A"}},{"$f":"VLOOKUP($A52,datos!$A$4:$AD$52,20)","v":{"$error":"#N/A"}},{"$f":"VLOOKUP($A52,datos!$A$4:$AD$52,21)","v":{"$error":"#N/A"}},{"$error":"#N/A"},{"$f":"VLOOKUP($A52,datos!$A$4:$AD$52,22)","v":{"$error":"#N/A"}},{"$f":"VLOOKUP($A52,datos!$A$4:$AD$52,23)","v":{"$error":"#N/A"}},{"$f":"VLOOKUP($A52,datos!$A$4:$AD$52,24)","v":{"$error":"#N/A"}},{"$f":"VLOOKUP($A52,datos!$A$4:$AD$52,25)","v":{"$error":"#N/A"}},{"$f":"VLOOKUP($A52,datos!$A$4:$AD$52,26)","v":{"$error":"#N/A"}},{"$f":"VLOOKUP($A52,datos!$A$4:$AD$52,27)","v":{"$error":"#N/A"}},{"$error":"#N/A"},{"$f":"VLOOKUP($A52,datos!$A$4:$AD$52,28)","v":{"$error":"#N/A"}},{"$f":"VLOOKUP($A52,datos!$A$4:$AD$52,29)","v":{"$error":"#N/A"}},{"$error":"#N/A"},"46º",{"$f":"MAX($AG$7:$AG$51)-AG52","v":{"$error":"#N/A"}}]
["C19",{"$f":"VLOOKUP($A53,datos!$A$4:$AD$52,2)","v":{"$error":"#N/A"}},{"$f":"VLOOKUP($A53,datos!$A$4:$AD$52,3)","v":{"$error":"#N/A"}},{"$f":"VLOOKUP($A53,datos!$A$4:$AD$52,4)","v":{"$error":"#N/A"}},{"$f":"VLOOKUP($A53,datos!$A$4:$AD$52,5)","v":{"$error":"#N/A"}},{"$f":"VLOOKUP($A53,datos!$A$4:$AD$52,6)","v":{"$error":"#N/A"}},{"$f":"VLOOKUP($A53,datos!$A$4:$AD$52,7)","v":{"$error":"#N/A"}},{"$f":"VLOOKUP($A53,datos!$A$4:$AD$52,8)","v":{"$error":"#N/A"}},{"$f":"VLOOKUP($A53,datos!$A$4:$AD$52,9)","v":{"$error":"#N/A"}},{"$error":"#N/A"},{"$f":"VLOOKUP($A53,datos!$A$4:$AD$52,10)","v":{"$error":"#N/A"}},{"$f":"VLOOKUP($A53,datos!$A$4:$AD$52,11)","v":{"$error":"#N/A"}},{"$f":"VLOOKUP($A53,datos!$A$4:$AD$52,12)","v":{"$error":"#N/A"}},{"$f":"VLOOKUP($A53,datos!$A$4:$AD$52,13)","v":{"$error":"#N/A"}},{"$f":"VLOOKUP($A53,datos!$A$4:$AD$52,14)","v":{"$error":"#N/A"}},{"$f":"VLOOKUP($A53,datos!$A$4:$AD$52,15)","v":{"$error":"#N/A"}},{"$error":"#N/A"},{"$f":"VLOOKUP($A53,datos!$A$4:$AD$52,16)","v":{"$error":"#N/A"}},{"$f":"VLOOKUP($A53,datos!$A$4:$AD$52,17)","v":{"$error":"#N/A"}},{"$f":"VLOOKUP($A53,datos!$A$4:$AD$52,18)","v":{"$error":"#N/A"}},{"$f":"VLOOKUP($A53,datos!$A$4:$AD$52,19)","v":{"$error":"#N/A"}},{"$f":"VLOOKUP($A53,datos!$A$4:$AD$52,20)","v":{"$error":"#N/A"}},{"$f":"VLOOKUP($A53,datos!$A$4:$AD$52,21)","v":{"$error":"#N/A"}},{"$error":"#N/A"},{"$f":"VLOOKUP($A53,datos!$A$4:$AD$52,22)","v":{"$error":"#N/A"}},{"$f":"VLOOKUP($A53,datos!$A$4:$AD$52,23)","v":{"$error":"#N/A"}},{"$f":"VLOOKUP($A53,datos!$A$4:$AD$52,24)","v":{"$error":"#N/A"}},{"$f":"VLOOKUP($A53,datos!$A$4:$AD$52,25)","v":{"$error":"#N/A"}},{"$f":"VLOOKUP($A53,datos!$A$4:$AD$52,26)","v":{"$error":"#N/A"}},{"$f":"VLOOKUP($A53,datos!$A$4:$AD$52,27)","v":{"$error":"#N/A"}},{"$error":"#N/A"},{"$f":"VLOOKUP($A53,datos!$A$4:$AD$52,28)","v":{"$error":"#N/A"}},{"$f":"VLOOKUP($A53,datos!$A$4:$AD$52,29)","v":{"$error":"#N/A"}},{"$error":"#N/A"},"47º",{"$f":"MAX($AG$7:$AG$51)-AG53","v":{"$error":"#N/A"}}]
["C49",{"$f":"VLOOKUP($A54,datos!$A$4:$AD$52,2)","v":{"$error":"#N/A"}},{"$f":"VLOOKUP($A54,datos!$A$4:$AD$52,3)","v":{"$error":"#N/A"}},{"$f":"VLOOKUP($A54,datos!$A$4:$AD$52,4)","v":{"$error":"#N/A"}},{"$f":"VLOOKUP($A54,datos!$A$4:$AD$52,5)","v":{"$error":"#N/A"}},{"$f":"VLOOKUP($A54,datos!$A$4:$AD$52,6)","v":{"$error":"#N/A"}},{"$f":"VLOOKUP($A54,datos!$A$4:$AD$52,7)","v":{"$error":"#N/A"}},{"$f":"VLOOKUP($A54,datos!$A$4:$AD$52,8)","v":{"$error":"#N/A"}},{"$f":"VLOOKUP($A54,datos!$A$4:$AD$52,9)","v":{"$error":"#N/A"}},{"$error":"#N/A"},{"$f":"VLOOKUP($A54,datos!$A$4:$AD$52,10)","v":{"$error":"#N/A"}},{"$f":"VLOOKUP($A54,datos!$A$4:$AD$52,11)","v":{"$error":"#N/A"}},{"$f":"VLOOKUP($A54,datos!$A$4:$AD$52,12)","v":{"$error":"#N/A"}},{"$f":"VLOOKUP($A54,datos!$A$4:$AD$52,13)","v":{"$error":"#N/A"}},{"$f":"VLOOKUP($A54,datos!$A$4:$AD$52,14)","v":{"$error":"#N/A"}},{"$f":"VLOOKUP($A54,datos!$A$4:$AD$52,15)","v":{"$error":"#N/A"}},{"$error":"#N/A"},{"$f":"VLOOKUP($A54,datos!$A$4:$AD$52,16)","v":{"$error":"#N/A"}},{"$f":"VLOOKUP($A54,datos!$A$4:$AD$52,17)","v":{"$error":"#N/A"}},{"$f":"VLOOKUP($A54,datos!$A$4:$AD$52,18)","v":{"$error":"#N/A"}},{"$f":"VLOOKUP($A54,datos!$A$4:$AD$52,19)","v":{"$error":"#N/A"}},{"$f":"VLOOKUP($A54,datos!$A$4:$AD$52,20)","v":{"$error":"#N/A"}},{"$f":"VLOOKUP($A54,datos!$A$4:$AD$52,21)","v":{"$error":"#N/A"}},{"$error":"#N/A"},{"$f":"VLOOKUP($A54,datos!$A$4:$AD$52,22)","v":{"$error":"#N/A"}},{"$f":"VLOOKUP($A54,datos!$A$4:$AD$52,23)","v":{"$error":"#N/A"}},{"$f":"VLOOKUP($A54,datos!$A$4:$AD$52,24)","v":{"$error":"#N/A"}},{"$f":"VLOOKUP($A54,datos!$A$4:$AD$52,25)","v":{"$error":"#N/A"}},{"$f":"VLOOKUP($A54,datos!$A$4:$AD$52,26)","v":{"$error":"#N/A"}},{"$f":"VLOOKUP($A54,datos!$A$4:$AD$52,27)","v":{"$error":"#N/A"}},{"$error":"#N/A"},{"$f":"VLOOKUP($A54,datos!$A$4:$AD$52,28)","v":{"$error":"#N/A"}},{"$f":"VLOOKUP($A54,datos!$A$4:$AD$52,29)","v":{"$error":"#N/A"}},{"$error":"#N/A"},"48º",{"$f":"MAX($AG$7:$AG$51)-AG54","v":{"$error":"#N/A"}}]
["C31",{"$f":"VLOOKUP($A55,datos!$A$4:$AD$52,2)","v":{"$error":"#N/A"}},{"$f":"VLOOKUP($A55,datos!$A$4:$AD$52,3)","v":{"$error":"#N/A"}},{"$f":"VLOOKUP($A55,datos!$A$4:$AD$52,4)","v":{"$error":"#N/A"}},{"$f":"VLOOKUP($A55,datos!$A$4:$AD$52,5)","v":{"$error":"#N/A"}},{"$f":"VLOOKUP($A55,datos!$A$4:$AD$52,6)","v":{"$error":"#N/A"}},{"$f":"VLOOKUP($A55,datos!$A$4:$AD$52,7)","v":{"$error":"#N/A"}},{"$f":"VLOOKUP($A55,datos!$A$4:$AD$52,8)","v":{"$error":"#N/A"}},{"$f":"VLOOKUP($A55,datos!$A$4:$AD$52,9)","v":{"$error":"#N/A"}},{"$error":"#N/A"},{"$f":"VLOOKUP($A55,datos!$A$4:$AD$52,10)","v":{"$error":"#N/A"}},{"$f":"VLOOKUP($A55,datos!$A$4:$AD$52,11)","v":{"$error":"#N/A"}},{"$f":"VLOOKUP($A55,datos!$A$4:$AD$52,12)","v":{"$error":"#N/A"}},{"$f":"VLOOKUP($A55,datos!$A$4:$AD$52,13)","v":{"$error":"#N/A"}},{"$f":"VLOOKUP($A55,datos!$A$4:$AD$52,14)","v":{"$error":"#N/A"}},{"$f":"VLOOKUP($A55,datos!$A$4:$AD$52,15)","v":{"$error":"#N/A"}},{"$error":"#N/A"},{"$f":"VLOOKUP($A55,datos!$A$4:$AD$52,16)","v":{"$error":"#N/A"}},{"$f":"VLOOKUP($A55,datos!$A$4:$AD$52,17)","v":{"$error":"#N/A"}},{"$f":"VLOOKUP($A55,datos!$A$4:$AD$52,18)","v":{"$error":"#N/A"}},{"$f":"VLOOKUP($A55,datos!$A$4:$AD$52,19)","v":{"$error":"#N/A"}},{"$f":"VLOOKUP($A55,datos!$A$4:$AD$52,20)","v":{"$error":"#N/A"}},{"$f":"VLOOKUP($A55,datos!$A$4:$AD$52,21)","v":{"$error":"#N/A"}},{"$error":"#N/A"},{"$f":"VLOOKUP($A55,datos!$A$4:$AD$52,22)","v":{"$error":"#N/A"}},{"$f":"VLOOKUP($A55,datos!$A$4:$AD$52,23)","v":{"$error":"#N/A"}},{"$f":"VLOOKUP($A55,datos!$A$4:$AD$52,24)","v":{"$error":"#N/A"}},{"$f":"VLOOKUP($A55,datos!$A$4:$AD$52,25)","v":{"$error":"#N/A"}},{"$f":"VLOOKUP($A55,datos!$A$4:$AD$52,26)","v":{"$error":"#N/A"}},{"$f":"VLOOKUP($A55,datos!$A$4:$AD$52,27)","v":{"$error":"#N/A"}},{"$error":"#N/A"},{"$f":"VLOOKUP($A55,datos!$A$4:$AD$52,28)","v":{"$error":"#N/A"}},{"$f":"VLOOKUP($A55,datos!$A$4:$AD$52,29)","v":{"$error":"#N/A"}},{"$error":"#N/A"},"49º",{"$f":"MAX($AG$7:$AG$51)-AG55","v":{"$error":"#N/A"}}]

{"sheet":"EVENTO PAIS","index":6,"n_rows":45,"n_cols":8,"rows_kept":45,"cut":false,"hidden":false,"merged":[[41,6,44,6],[41,7,44,7],[11,6,14,6],[11,7,14,7],[17,6,20,6],[17,7,20,7],[23,6,26,6],[23,7,26,7],[29,6,32,6],[29,7,32,7],[35,6,38,6],[35,7,38,7],[1,0,1,7],[2,0,2,7],[5,6,8,6],[5,7,8,7],[3,1,3,7]]}
[]
["    CAMPEONATO SUDAMERICANO JUVENIL 2014"]
["TODO EVENTO PAIS"]
[]
["Cod","Nombre del Jugador","FEDERACION","TOTAL PALOS","PROM IND",{"$f":"G6","v":19061},"TOTAL EQ","PROM EQ"]
["j24",{"$f":"VLOOKUP($A6,datos!$A$4:$AD$52,2)","v":"CARLOS F. SAAVEDRA"},{"$f":"VLOOKUP($A6,datos!$A$4:$AD$52,3)","v":"Colombia"},{"$f":"VLOOKUP($A6,datos!$A$4:$AD$52,29)","v":4636},{"$f":"D6/24","v":193.16666666666666},{"$f":"G6","v":19061},{"$f":"SUM(D6:D9)","v":19061},{"$f":"SUM(E6:E9)/4","v":198.55208333333331}]
["j25",{"$f":"VLOOKUP($A7,datos!$A$4:$AD$52,2)","v":"SEBASTIAN DONADO"},{"$f":"VLOOKUP($A7,datos!$A$4:$AD$52,3)","v":"Colombia"},{"$f":"VLOOKUP($A7,datos!$A$4:$AD$52,29)","v":4606},{"$f":"D7/24","v":191.91666666666666},{"$f":"G6","v":19061}]
["j26",{"$f":"VLOOKUP($A8,datos!$A$4:$AD$52,2)","v":"SEBASTIAN CHARRY"},{"$f":"VLOOKUP($A8,datos!$A$4:$AD$52,3)","v":"Colombia"},{"$f":"VLOOKUP($A8,datos!$A$4:$AD$52,29)","v":4898},{"$f":"D8/24","v":204.08333333333334},{"$f":"G6","v":19061}]
["j27",{"$f":"VLOOKUP($A9,datos!$A$4:$AD$52,2)","v":"JORGE FIGUEROA"},{"$f":"VLOOKUP($A9,datos!$A$4:$AD$52,3)","v":"Colombia"},{"$f":"VLOOKUP($A9,datos!$A$4:$AD$52,29)","v":4921},{"$f":"D9/24","v":205.04166666666666},{"$f":"G6","v":19061}]
[null,null,null,null,null,{"$f":"G6","v":19061}]
["Cod","Nombre del Jugador","FEDERACION","TOTAL PALOS","PROM IND",{"$f":"G12","v":18410},"TOTAL EQ","PROM EQ"]
["j20",{"$f":"VLOOKUP($A12,datos!$A$4:$AD$52,2)","v":"BRUNO COSTA S"},{"$f":"VLOOKUP($A12,datos!$A$4:$AD$52,3)","v":"Brasil"},{"$f":"VLOOKUP($A12,datos!$A$4:$AD$52,29)","v":5148},{"$f":"D12/24","v":214.5},{"$f":"G12","v":18410},{"$f":"SUM(D12:D15)","v":18410},{"$f":"SUM(E12:E15)/4","v":191.77083333333331}]
["j21",{"$f":"VLOOKUP($A13,datos!$A$4:$AD$52,2)","v":"BERNARDO ABREU"},{"$f":"VLOOKUP($A13,datos!$A$4:$AD$52,3)","v":"Brasil"},{"$f":"VLOOKUP($A13,datos!$A$4:$AD$52,29)","v":4320},{"$f":"D13/24","v":180},{"$f":"G12","v":18410}]
["j22",{"$f":"VLOOKUP($A14,datos!$A$4:$AD$52,2)","v":"THIAGO FELICETTI"},{"$f":"VLOOKUP($A14,datos!$A$4:$AD$52,3)","v":"Brasil"},{"$f":"VLOOKUP($A14,datos!$A$4:$AD$52,29)","v":4471},{"$f":"D14/24","v":186.29166666666666},{"$f":"G12","v":18410}]
["j23",{"$f":"VLOOKUP($A15,datos!$A$4:$AD$52,2)","v":"JOAO I. FERREIRA N. "},{"$f":"VLOOKUP($A15,datos!$A$4:$AD$52,3)","v":"Brasil"},{"$f":"VLOOKUP($A15,datos!$A$4:$AD$52,29)","v":4471},{"$f":"D15/24","v":186.29166666666666},{"$f":"G12","v":18410}]
[null,null,null,null,null,{"$f":"G12","v":18410}]
["Cod","Nombre del Jugador","FEDERACION","TOTAL PALOS","PROM IND",{"$f":"G18","v":17887},"TOTAL EQ","PROM EQ"]
["j16",{"$f":"VLOOKUP($A18,datos!$A$4:$AD$52,2)","v":"BRIAN HELMEYER"},{"$f":"VLOOKUP($A18,datos!$A$4:$AD$52,3)","v":"Aruba"},{"$f":"VLOOKUP($A18,datos!$A$4:$AD$52,29)","v":4729},{"$f":"D18/24","v":197.04166666666666},{"$f":"G18","v":17887},{"$f":"SUM(D18:D21)","v":17887},{"$f":"SUM(E18:E21)/4","v":186.32291666666666}]
["j17",{"$f":"VLOOKUP($A19,datos!$A$4:$AD$52,2)","v":"YANNICK ROOS"},{"$f":"VLOOKUP($A19,datos!$A$4:$AD$52,3)","v":"Aruba"},{"$f":"VLOOKUP($A19,datos!$A$4:$AD$52,29)","v":4429},{"$f":"D19/24","v":184.54166666666666},{"$f":"G18","v":17887}]
["j18",{"$f":"VLOOKUP($A20,datos!$A$4:$AD$52,2)","v":"OSMAR BISLIP"},{"$f":"VLOOKUP($A20,datos!$A$4:$AD$52,3)","v":"Aruba"},{"$f":"VLOOKUP($A20,datos!$A$4:$AD$52,29)","v":4332},{"$f":"D20/24","v":180.5},{"$f":"G18","v":17887}]
["j19",{"$f":"VLOOKUP($A21,datos!$A$4:$AD$52,2)","v":"ELIAS HALABI"},{"$f":"VLOOKUP($A21,datos!$A$4:$AD$52,3)","v":"Aruba"},{"$f":"VLOOKUP($A21,datos!$A$4:$AD$52,29)","v":4397},{"$f":"D21/24","v":183.20833333333334},{"$f":"G18","v":17887}]
[null,null,null,null,null,{"$f":"G18","v":17887}]
["Cod","Nombre del Jugador","FEDERACION","TOT IND","PROM IND",{"$f":"G24","v":17654},"TOTAL EQ","PROM EQ"]
["j12",{"$f":"VLOOKUP($A24,datos!$A$4:$AD$52,2)","v":"AGUSTIN LEANDRO A."},{"$f":"VLOOKUP($A24,datos!$A$4:$AD$52,3)","v":"Argentina"},{"$f":"VLOOKUP($A24,datos!$A$4:$AD$52,29)","v":4411},{"$f":"D24/24","v":183.79166666666666},{"$f":"G24","v":17654},{"$f":"SUM(D24:D27)","v":17654},{"$f":"SUM(E24:E27)/4","v":183.89583333333334}]
["j13",{"$f":"VLOOKUP($A25,datos!$A$4:$AD$52,2)","v":"FRANCO R. GUALINI"},{"$f":"VLOOKUP($A25,datos!$A$4:$AD$52,3)","v":"Argentina"},{"$f":"VLOOKUP($A25,datos!$A$4:$AD$52,29)","v":4564},{"$f":"D25/24","v":190.16666666666666},{"$f":"G24","v":17654}]
["j14",{"$f":"VLOOKUP($A26,datos!$A$4:$AD$52,2)","v":"FABRICIO E. SANDUAY"},{"$f":"VLOOKUP($A26,datos!$A$4:$AD$52,3)","v":"Argentina"},{"$f":"VLOOKUP($A26,datos!$A$4:$AD$52,29)","v":4186},{"$f":"D26/24","v":174.41666666666666},{"$f":"G24","v":17654}]
["j15",{"$f":"VLOOKUP($A27,datos!$A$4:$AD$52,2)","v":"FERNANDO TAPIA M."},{"$f":"VLOOKUP($A27,datos!$A$4:$AD$52,3)","v":"Argentina"},{"$f":"VLOOKUP($A27,datos!$A$4:$AD$52,29)","v":4493},{"$f":"D27/24","v":187.20833333333334},{"$f":"G24","v":17654}]
[null,null,null,null,null,{"$f":"G24","v":17654}]
["Cod","Nombre del Jugador","FEDERACION","TOTAL PALOS","PROM IND",{"$f":"G30","v":17411},"TOTAL EQ","PROM EQ"]
["j32",{"$f":"VLOOKUP($A30,datos!$A$4:$AD$52,2)","v":"ADRIAN GUIBU K."},{"$f":"VLOOKUP($A30,datos!$A$4:$AD$52,3)","v":"Perú"},{"$f":"VLOOKUP($A30,datos!$A$4:$AD$52,29)","v":4271},{"$f":"D30/24","v":177.95833333333334},{"$f":"G30","v":17411},{"$f":"SUM(D30:D33)","v":17411},{"$f":"SUM(E30:E33)/4","v":181.36458333333334}]
["j33",{"$f":"VLOOKUP($A31,datos!$A$4:$AD$52,2)","v":"JUAN ANDRES YUZURIHA"},{"$f":"VLOOKUP($A31,datos!$A$4:$AD$52,3)","v":"Perú"},{"$f":"VLOOKUP($A31,datos!$A$4:$AD$52,29)","v":4599},{"$f":"D31/24","v":191.625},{"$f":"G30","v":17411}]
["j34",{"$f":"VLOOKUP($A32,datos!$A$4:$AD$52,2)","v":"KEIJI M. CAJACHACAHUA M."},{"$f":"VLOOKUP($A32,datos!$A$4:$AD$52,3)","v":"Perú"},{"$f":"VLOOKUP($A32,datos!$A$4:$AD$52,29)","v":4081},{"$f":"D32/24","v":170.04166666666666},{"$f":"G30","v":17411}]
["j35",{"$f":"VLOOKUP($A33,datos!$A$4:$AD$52,2)","v":"RENZO GUIBU K."},{"$f":"VLOOKUP($A33,datos!$A$4:$AD$52,3)","v":"Perú"},{"$f":"VLOOKUP($A33,datos!$A$4:$AD$52,29)","v":4460},{"$f":"D33/24","v":185.83333333333334},{"$f":"G30","v":17411}]
[null,null,null,null,null,{"$f":"G30","v":17411}]
["Cod","Nombre del Jugador","FEDERACION","TOTAL PALOS","PROM IND",{"$f":"G36","v":15000},"TOTAL EQ","PROM EQ"]
["j28",{"$f":"VLOOKUP($A36,datos!$A$4:$AD$52,2)","v":"BASTIAN MALDONADO R."},{"$f":"VLOOKUP($A36,datos!$A$4:$AD$52,3)","v":"Chile"},{"$f":"VLOOKUP($A36,datos!$A$4:$AD$52,29)","v":4336},{"$f":"D36/24","v":180.66666666666666},{"$f":"G36","v":15000},{"$f":"SUM(D36:D39)","v":15000},{"$f":"SUM(E36:E39)/4","v":156.25}]
["j29",{"$f":"VLOOKUP($A37,datos!$A$4:$AD$52,2)","v":"MATIAS NAZAR G."},{"$f":"VLOOKUP($A37,datos!$A$4:$AD$52,3)","v":"Chile"},{"$f":"VLOOKUP($A37,datos!$A$4:$AD$52,29)","v":4079},{"$f":"D37/24","v":169.95833333333334},{"$f":"G36","v":15000}]
["j30",{"$f":"VLOOKUP($A38,datos!$A$4:$AD$52,2)","v":"IVAN VELIZ H."},{"$f":"VLOOKUP($A38,datos!$A$4:$AD$52,3)","v":"Chile"},{"$f":"VLOOKUP($A38,datos!$A$4:$AD$52,29)","v":3461},{"$f":"D38/24","v":144.20833333333334},{"$f":"G36","v":15000}]
["j31",{"$f":"VLOOKUP($A39,datos!$A$4:$AD$52,2)","v":"LUIS JEREZ G."},{"$f":"VLOOKUP($A39,datos!$A$4:$AD$52,3)","v":"Chile"},{"$f":"VLOOKUP($A39,datos!$A$4:$AD$52,29)","v":3124},{"$f":"D39/24","v":130.16666666666666},{"$f":"G36","v":15000}]
[null,null,null,null,null,{"$f":"G36","v":15000}]
["Cod","Nombre del Jugador","FEDERACION","TOTAL PALOS","PROM IND",{"$f":"G42","v":10753},"TOTAL EQ","PROM EQ"]
["j36",{"$f":"VLOOKUP($A42,datos!$A$4:$AD$52,2)","v":"MATIAS DA MOTTA L."},{"$f":"VLOOKUP($A42,datos!$A$4:$AD$52,3)","v":"Uruguay"},{"$f":"VLOOKUP($A42,datos!$A$4:$AD$52,29)","v":3656},{"$f":"D42/24","v":152.33333333333334},{"$f":"G42","v":10753},{"$f":"SUM(D42:D45)","v":10753},{"$f":"SUM(E42:E45)/3","v":149.3472222222222}]
["j37",{"$f":"VLOOKUP($A43,datos!$A$4:$AD$52,2)","v":"ALFONSO RODRIGUEZ L."},{"$f":"VLOOKUP($A43,datos!$A$4:$AD$52,3)","v":"Uruguay"},{"$f":"VLOOKUP($A43,datos!$A$4:$AD$52,29)","v":3463},144.29166666666666,{"$f":"G42","v":10753}]
["j38",{"$f":"VLOOKUP($A44,datos!$A$4:$AD$52,2)","v":"FELIPE FUENTES F."},{"$f":"VLOOKUP($A44,datos!$A$4:$AD$52,3)","v":"Uruguay"},{"$f":"VLOOKUP($A44,datos!$A$4:$AD$52,29)","v":3634},151.41666666666666,{"$f":"G42","v":10753}]
[null,null,null,null,null,{"$f":"G42","v":10753}]

{"sheet":"ROUND ROBIN","index":7,"n_rows":33,"n_cols":21,"rows_kept":33,"cut":false,"hidden":false,"merged":[[0,0,2,0],[0,1,0,15],[0,16,2,20],[1,1,1,15],[2,1,2,15],[25,7,27,9],[28,3,28,5],[28,11,28,13],[28,15,28,20],[24,3,24,5],[24,11,24,13],[24,15,24,20],[33,0,33,1],[30,2,30,3],[30,5,30,9],[31,0,31,1],[32,2,32,3],[32,5,32,9]]}
[null,"CAMPEONATO SUDAMERICANO JUVENIL 2014"]
[null,"SANTIAGO DE CHILE DEL 12 AL 18 DE ABRIL D 2014"]
[null,"FINAL MASTER SUB 20"]
["DEPORTISTA","PAÍS","TODO EVENTO","LÍNEA 1","BONIF","LÍNEA 2","BONIF","LÍNEA 3","BONIF","LÍNEA 4","BONIF","LÍNEA 5","BONIF","LÍNEA 6","BONIF","LÍNEA 7","BONIF ","TOTAL","Prom s/bonif","DIF.","POSICIÓN"]
["BRUNO SOARES COSTA","Brasil",5148,152,0,230,20,179,0,227,20,224,20,204,20,226,20,{"$f":"D5+E5+F5+G5+H5+I5+J5+K5+L5+M5+N5+O5+P5+Q5+C5","v":6690},null,{"$f":"R5-R5","v":0},"1°"]
["JORGE FIGUEROA","Colombia",4921,224,20,226,20,225,20,215,0,195,0,194,0,277,20,6557,null,{"$f":"R5-R6","v":133},"2°"]
["SEBASTIAN CHARRY","Colombia",4898,212,20,219,0,212,0,228,20,194,0,224,20,224,20,6491,null,{"$f":"R5-R7","v":199},"3°"]
["CARLOS F. SAAVEDRA","Colombia",4636,220,20,182,10,216,20,244,20,254,20,183,20,191,20,6256,null,{"$f":"R5-R8","v":434},"4°"]
["SEBASTIAN DONADO","Colombia",4606,184,0,247,20,186,20,215,20,199,20,157,0,215,20,6109,null,{"$f":"R5-R9","v":581},"5°"]
["FRANCO R. GUALINI","Argentina",4564,165,20,222,0,223,0,190,20,248,20,174,20,214,20,6100,null,{"$f":"R5-R10","v":590},"6°"]
["BRIAN HELMEYER","Aruba",4729,143,0,185,0,183,0,192,20,182,20,170,0,195,20,6039,null,{"$f":"R5-R11","v":651},"7°"]
["JUAN ANDRES YUZURIHA","Perú",4599,188,0,182,10,221,20,145,0,183,0,179,0,206,20,5953,null,{"$f":"R5-R12","v":737},"8°"]
["THIAGO FELICETTI","Brasil",4471,175,0,182,20,212,20,265,20,184,0,183,20,180,0,5932,null,{"$f":"R5-R13","v":758},"9°"]
["FERNANDO M. TAPIA","Argentina",4493,168,0,203,20,199,20,198,0,211,20,159,0,179,0,5870,null,{"$f":"R5-R14","v":820},"10°"]
["JOAO I. FERREIRA N. ","Brasil",4471,193,0,173,0,192,0,215,20,219,20,144,0,148,0,5795,null,{"$f":"R5-R15","v":895},"11°"]
["ELIAS HALABI","Aruba",4397,233,20,185,0,192,0,163,0,192,0,201,20,179,0,5782,null,{"$f":"R5-R16","v":908},"12°"]
["YANNICK ROOS","Aruba",4429,196,20,201,20,211,20,165,0,157,0,149,0,200,0,5768,null,{"$f":"R5-R17","v":922},"13°"]
["AGUSTIN L. ARANGUREN","Argentina",4411,183,20,158,0,211,20,158,0,156,0,199,20,183,0,5719,null,{"$f":"R5-R18","v":971},"14°"]
["RENZO GUIBU K.","Perú",4460,182,0,141,0,191,0,165,0,153,0,180,20,221,0,5713,null,{"$f":"R5-R19","v":977},"15°"]
["BASTIAN MALDONADO R.","Chile",4336,225,20,162,20,211,0,172,0,215,20,162,0,149,0,5692,null,{"$f":"R5-R20","v":998},"16°"]
[]
[]
[]
["BRUNO COSTA",223]
["1° VS 4°",null,null,"BRUNO COSTA",null,null,"G1",null,null,201,null,"CAMPEÓN",null,null,null,"JORGE FIGUEROA"]
["CARLOS SAAVEDRA",205,null,null,null,null,null,"G1 VS G2"]
[]
["SEBASTIÁN CHARRY",208]
["2° VS 3°",null,null,"JORGE FIGUEROA",null,null,"G2",null,222,null,null,"SUBCAMPEÓN",null,null,null,"BRUNO COSTA"]
["JORGE FIGUEROA",216]
["TERCERO",null,"BRONCE",null,null,"SEBASTIÁN CHARRY"]
[]
["TERCERO",null,"BRONCE",null,null,"CARLOS SAAVEDRA"]