{"text_format":"1","workbook":"xlsx","n_sheets":8,"sheets":["datos","IND.","PAR","TER","cuarteto","T EVENTO","EVENTO PAIS","ROUND ROBIN"],"not_rendered":{"charts":0,"images":1,"macros":1,"external_links":0,"defined_names":8,"comments":0,"pivot_tables":0},"unopened":[],"bounds":{"document_bytes":16777216,"sheet_cells":100000,"rows_first":2000,"rows_last":500,"rows_between":2000,"halvings":0,"cell_chars":16384,"cell_head_chars":4096},"cells_cut":0,"cells_raw":0,"read":"whole","date_system":"1900"}

{"sheet":"datos","index":0,"n_rows":53,"n_cols":35,"rows_kept":53,"cut":false,"hidden":true,"merged":[]}
[null,"solamente carga de datos"]
[null,null,null,null,null,null,null,null,null,null,null,null,null,null,null,null,null," "]
[null,"Apellido y Nombre","FEDE","L1","L2","L3","L4","L5","L6","L7","L8","L9","L10","L11","L12","L13","L14","L15","L16","L17","L18","L19","L20","L21","L22","L23","L24","LIN","TOTAL","PROM"]
["j12","AGUSTIN LEANDRO A.","Argentina",184,165,165,203,178,172,147,210,171,219,157,188,138,177,180,184,221,153,188,199,195,181,191,245,{"$f":"COUNTIF(D4:AA4,\">0\")","v":24},{"$f":"SUM(D4:AA4)","v":4411},{"$f":"AC4/AB4","v":183.79166666666666},null,null,null,null,1]
["j13","FRANCO R. GUALINI","Argentina",200,185,192,204,177,215,168,172,180,188,182,198,187,160,229,203,189,224,178,234,156,226,162,155,24,4564,{"$f":"AC5/AB5","v":190.16666666666666},null,null,null,null,2]
["j14","FABRICIO E. SANDUAY","Argentina",140,150,204,211,146,194,170,171,157,168,178,125,202,162,161,176,211,194,203,171,209,178,126,179,24,4186,174.41666666666666,null,null,null,null,3]
["j15","FERNANDO TAPIA M.","Argentina",193,223,180,214,183,161,205,180,149,157,176,187,206,182,179,201,202,171,251,171,184,192,165,181,24,4493,187.20833333333334,null,null,null,null,4]
["j16","BRIAN HELMEYER","Aruba",176,217,155,238,174,192,177,172,193,200,235,184,227,245,187,197,211,167,185,233,188,185,203,188,24,4729,197.04166666666666,null,null,null,null,5]
["j17","YANNICK ROOS","Aruba",162,206,207,204,193,182,187,147,135,143,161,158,195,180,193,182,233,200,178,195,172,212,212,192,24,4429,184.54166666666666,null,null,null,null,6]
["j18","OSMAR BISLIP","Aruba",205,195,162,164,192,168,205,159,158,200,145,175,163,172,161,181,193,256,159,195,172,158,221,173,24,4332,180.5,null,null,null,null,7]
{"$rows_left_out":44}
{"sheet":"IND.","index":1,"n_rows":32,"n_cols":14,"rows_kept":32,"cut":false,"hidden":false,"merged":[[3,1,3,13],[1,0,1,13],[2,0,2,13]]}
[]
["CAMPEONATO SUDAMERICANO JUVENIL 2014"]
["INDVIDUAL SUB 20"]
[]
["Cod","Nombre del Jugador","FEDERACION","L1","L2","L3","L4","L5","L6","total","lin","Prom","Pos.","dif"]
["j26",{"$f":"VLOOKUP($A6,datos!$A$4:$AD$52,2)","v":"SEBASTIAN CHARRY"},{"$f":"VLOOKUP($A6,datos!$A$4:$AD$52,3)","v":"Colombia"},{"$f":"VLOOKUP($A6,datos!$A$4:$AD$52,4)","v":223},{"$f":"VLOOKUP($A6,datos!$A$4:$AD$52,5)","v":223},{"$f":"VLOOKUP($A6,datos!$A$4:$AD$52,6)","v":162},{"$f":"VLOOKUP($A6,datos!$A$4:$AD$52,7)","v":246},{"$f":"VLOOKUP($A6,datos!$A$4:$AD$52,8)","v":227},{"$f":"VLOOKUP($A6,datos!$A$4:$AD$52,9)","v":257},{"$f":"SUM(D6:I6)","v":1338},{"$f":"COUNTIF(D6:I6,\">0\")","v":6},{"$f":"J6/K6","v":223},"1°",{"$f":"MAX($J$6:$J$32)-J6","v":0}]
["j20",{"$f":"VLOOKUP($A7,datos!$A$4:$AD$52,2)","v":"BRUNO COSTA S"},{"$f":"VLOOKUP($A7,datos!$A$4:$AD$52,3)","v":"Brasil"},{"$f":"VLOOKUP($A7,datos!$A$4:$AD$52,4)","v":202},{"$f":"VLOOKUP($A7,datos!$A$4:$AD$52,5)","v":265},{"$f":"VLOOKUP($A7,datos!$A$4:$AD$52,6)","v":214},{"$f":"VLOOKUP($A7,datos!$A$4:$AD$52,7)","v":185},{"$f":"VLOOKUP($A7,datos!$A$4:$AD$52,8)","v":211},{"$f":"VLOOKUP($A7,datos!$A$4:$AD$52,9)","v":233},1310,6,218.33333333333334,"2°",28]
["j24",{"$f":"VLOOKUP($A8,datos!$A$4:$AD$52,2)","v":"CARLOS F. SAAVEDRA"},{"$f":"VLOOKUP($A8,datos!$A$4:$AD$52,3)","v":"Colombia"},{"$f":"VLOOKUP($A8,datos!$A$4:$AD$52,4)","v":192},{"$f":"VLOOKUP($A8,datos!$A$4:$AD$52,5)","v":233},{"$f":"VLOOKUP($A8,datos!$A$4:$AD$52,6)","v":245},{"$f":"VLOOKUP($A8,datos!$A$4:$AD$52,7)","v":199},{"$f":"VLOOKUP($A8,datos!$A$4:$AD$52,8)","v":244},{"$f":"VLOOKUP($A8,datos!$A$4:$AD$52,9)","v":193},1306,6,217.66666666666666,"3°",32]
["j35",{"$f":"VLOOKUP($A9,datos!$A$4:$AD$52,2)","v":"RENZO GUIBU K."},{"$f":"VLOOKUP($A9,datos!$A$4:$AD$52,3)","v":"Perú"},{"$f":"VLOOKUP($A9,datos!$A$4:$AD$52,4)","v":214},{"$f":"VLOOKUP($A9,datos!$A$4:$AD$52,5)","v":214},{"$f":"VLOOKUP($A9,datos!$A$4:$AD$52,6)","v":232},{"$f":"VLOOKUP($A9,datos!$A$4:$AD$52,7)","v":224},{"$f":"VLOOKUP($A9,datos!$A$4:$AD$52,8)","v":192},{"$f":"VLOOKUP($A9,datos!$A$4:$AD$52,9)","v":211},1287,6,214.5,"4°",51]
["j27",{"$f":"VLOOKUP($A10,datos!$A$4:$AD$52,2)","v":"JORGE FIGUEROA"},{"$f":"VLOOKUP($A10,datos!$A$4:$AD$52,3)","v":"Colombia"},{"$f":"VLOOKUP($A10,datos!$A$4:$AD$52,4)","v":216},{"$f":"VLOOKUP($A10,datos!$A$4:$AD$52,5)","v":214},{"$f":"VLOOKUP($A10,datos!$A$4:$AD$52,6)","v":224},{"$f":"VLOOKUP($A10,datos!$A$4:$AD$52,7)","v":233},{"$f":"VLOOKUP($A10,datos!$A$4:$AD$52,8)","v":169},{"$f":"VLOOKUP($A10,datos!$A$4:$AD$52,9)","v":207},1263,6,210.5,"5°",75]
{"$rows_left_out":23}
{"sheet":"PAR","index":2,"n_rows":124,"n_cols":17,"rows_kept":124,"cut":false,"hidden":false,"merged":[[1,0,1,13],[2,0,2,13],[101,13,102,13],[61,13,62,13],[11,13,12,13],[41,13,42,13],[31,13,32,13],[3,1,3,13],[56,13,57,13],[6,13,7,13],[51,13,52,13],[76,13,77,13],[86,13,87,13],[66,13,67,13],[71,13,72,13],[81,13,82,13],[116,13,117,13],[121,13,122,13],[16,13,17,13],[91,13,92,13],[21,13,22,13],[46,13,47,13],[36,13,37,13],[26,13,27,13],[111,13,112,13],[96,13,97,13],[106,13,107,13]]}
[]
["             CAMPEONATO SUDAMERICANO JUVENIL 2014"]
["DOBLES  SUB 20"]
[]
["Cod","Nombre del Jugador","FEDERACION","L1","L2","L3","L4","L5","L6","Serie",null,{"$f":"M8","v":193.33333333333334},"Prom","dif"]
["j27",{"$f":"VLOOKUP($A6,datos!$A$4:$AD$52,2)","v":"JORGE FIGUEROA"},{"$f":"VLOOKUP($A6,datos!$A$4:$AD$52,3)","v":"Colombia"},{"$f":"VLOOKUP($A6,datos!$A$4:$AD$52,10)","v":242},{"$f":"VLOOKUP($A6,datos!$A$4:$AD$52,11)","v":148},{"$f":"VLOOKUP($A6,datos!$A$4:$AD$52,12)","v":216},{"$f":"VLOOKUP($A6,datos!$A$4:$AD$52,13)","v":212},{"$f":"VLOOKUP($A6,datos!$A$4:$AD$52,14)","v":184},{"$f":"VLOOKUP($A6,datos!$A$4:$AD$52,15)","v":175},{"$f":"SUM(D6:I6)","v":1177},{"$f":"(COUNTIF(D6:I6,\">0\"))","v":6},{"$f":"M8","v":193.33333333333334},{"$f":"J6/K6","v":196.16666666666666}]
["j25",{"$f":"VLOOKUP($A7,datos!$A$4:$AD$52,2)","v":"SEBASTIAN DONADO"},{"$f":"VLOOKUP($A7,datos!$A$4:$AD$52,3)","v":"Colombia"},{"$f":"VLOOKUP($A7,datos!$A$4:$AD$52,10)","v":173},{"$f":"VLOOKUP($A7,datos!$A$4:$AD$52,11)","v":197},{"$f":"VLOOKUP($A7,datos!$A$4:$AD$52,12)","v":200},{"$f":"VLOOKUP($A7,datos!$A$4:$AD$52,13)","v":157},{"$f":"VLOOKUP($A7,datos!$A$4:$AD$52,14)","v":214},{"$f":"VLOOKUP($A7,datos!$A$4:$AD$52,15)","v":202},{"$f":"SUM(D7:I7)","v":1143},{"$f":"(COUNTIF(D7:I7,\">0\"))","v":6},{"$f":"M8","v":193.33333333333334},{"$f":"J7/K7","v":190.5},"1°"]
[null,null,null,{"$f":"SUM(D6:D7)","v":415},345,416,369,398,377,2320,{"$f":"(COUNTIF(D8:I8,\">0\"))*2","v":12},{"$f":"M8","v":193.33333333333334},{"$f":"J8/K8","v":193.33333333333334},null,null,{"$f":"MAX(D8:I8)","v":416}]
[null,null,null,null,null,null,null,null,null,null,null,{"$f":"M8","v":193.33333333333334}]
["Cod","Nombre del Jugador","FEDERACION","L1","L2","L3","L4","L5","L6","Serie",null,{"$f":"M13","v":192.66666666666666},"Prom","dif"]
{"$rows_left_out":115}
{"sheet":"TER","index":3,"n_rows":52,"n_cols":16,"rows_kept":52,"cut":false,"hidden":false,"merged":[[49,13,50,13],[25,13,26,13],[37,13,38,13],[3,1,3,13],[19,13,20,13],[31,13,32,13],[1,0,1,13],[2,0,2,13],[43,13,44,13],[7,13,8,13],[13,13,14,13]]}
[]
["  CAMPEONATO SUDAMERICANO JUVENIL 2014"]
["TRIOS  SUB 20"]
[]
["Cod","Nombre del Jugador","FEDERACION","L1","L2","L3","L4","L5","L6","Serie",null,{"$f":"J9","v":3796},"Prom"]
["j23",{"$f":"VLOOKUP($A6,datos!$A$4:$AD$52,2)","v":"JOAO I. FERREIRA N. "},{"$f":"VLOOKUP($A6,datos!$A$4:$AD$52,3)","v":"Brasil"},{"$f":"VLOOKUP($A6,datos!$A$4:$AD$52,16)","v":212},{"$f":"VLOOKUP($A6,datos!$A$4:$AD$52,17)","v":200},{"$f":"VLOOKUP($A6,datos!$A$4:$AD$52,18)","v":256},{"$f":"VLOOKUP($A6,datos!$A$4:$AD$52,19)","v":156},{"$f":"VLOOKUP($A6,datos!$A$4:$AD$52,20)","v":186},{"$f":"VLOOKUP($A6,datos!$A$4:$AD$52,21)","v":194},{"$f":"SUM(D6:I6)","v":1204},{"$f":"COUNTIF(D6:I6,\">0\")","v":6},{"$f":"J9","v":3796},{"$f":"J6/K6","v":200.66666666666666},"dif"]
["j22",{"$f":"VLOOKUP($A7,datos!$A$4:$AD$52,2)","v":"THIAGO FELICETTI"},{"$f":"VLOOKUP($A7,datos!$A$4:$AD$52,3)","v":"Brasil"},{"$f":"VLOOKUP($A7,datos!$A$4:$AD$52,16)","v":180},{"$f":"VLOOKUP($A7,datos!$A$4:$AD$52,17)","v":184},{"$f":"VLOOKUP($A7,datos!$A$4:$AD$52,18)","v":233},{"$f":"VLOOKUP($A7,datos!$A$4:$AD$52,19)","v":235},{"$f":"VLOOKUP($A7,datos!$A$4:$AD$52,20)","v":180},{"$f":"VLOOKUP($A7,datos!$A$4:$AD$52,21)","v":162},{"$f":"SUM(D7:I7)","v":1174},{"$f":"COUNTIF(D7:I7,\">0\")","v":6},{"$f":"J9","v":3796},{"$f":"J7/K7","v":195.66666666666666},{"$f":"MAX($J$51,$J$45,$J$27,$J$39,$J$21,$J$33,$J$9,$J$15)-J9","v":0}]
["j20",{"$f":"VLOOKUP($A8,datos!$A$4:$AD$52,2)","v":"BRUNO COSTA S"},{"$f":"VLOOKUP($A8,datos!$A$4:$AD$52,3)","v":"Brasil"},{"$f":"VLOOKUP($A8,datos!$A$4:$AD$52,16)","v":182},{"$f":"VLOOKUP($A8,datos!$A$4:$AD$52,17)","v":277},{"$f":"VLOOKUP($A8,datos!$A$4:$AD$52,18)","v":225},{"$f":"VLOOKUP($A8,datos!$A$4:$AD$52,19)","v":254},{"$f":"VLOOKUP($A8,datos!$A$4:$AD$52,20)","v":267},{"$f":"VLOOKUP($A8,datos!$A$4:$AD$52,21)","v":213},{"$f":"SUM(D8:I8)","v":1418},{"$f":"COUNTIF(D8:I8,\">0\")","v":6},{"$f":"J9","v":3796},{"$f":"J8/K8","v":236.33333333333334},1]
[null,null,null,{"$f":"SUM(D6:D8)","v":574},661,714,645,633,569,3796,{"$f":"COUNTIF(D9:I9,\">0\")*3","v":18},{"$f":"J9","v":3796},{"$f":"J9/K9","v":210.88888888888889},null,null,{"$f":"MAX(D39:I39)","v":631}]
[null,null,null,null,null,null,null,null,null,null,null,{"$f":"J9","v":3796}]
{"$rows_left_out":43}
{"sheet":"cuarteto","index":4,"n_rows":60,"n_cols":16,"rows_kept":60,"cut":false,"hidden":false,"merged":[[3,1,3,13],[1,0,1,13],[2,0,2,13],[50,13,51,13],[57,13,58,13],[15,13,16,13],[36,13,37,13],[43,13,44,13],[8,13,9,13],[29,13,30,13],[22,13,23,13]]}
[]
["CAMPEONATO SUDAMERICANO JUVENIL 2014"]
["EQUIPOS SUB 20"]
[null,"            SANTIAGO DE CHILE - DEL 12 AL 18 DE ABRIL DE 2014"]
["Cod","Nombre del Jugador","FEDERACION","L1","L2","L3","L4","L5","L6","Serie",{"$f":"J10","v":4631},null,"Prom"]
["j24",{"$f":"VLOOKUP($A6,datos!$A$4:$AD$52,2)","v":"CARLOS F. SAAVEDRA"},{"$f":"VLOOKUP($A6,datos!$A$4:$AD$52,3)","v":"Colombia"},{"$f":"VLOOKUP($A6,datos!$A$4:$AD$52,22)","v":164},{"$f":"VLOOKUP($A6,datos!$A$4:$AD$52,23)","v":167},{"$f":"VLOOKUP($A6,datos!$A$4:$AD$52,24)","v":233},{"$f":"VLOOKUP($A6,datos!$A$4:$AD$52,25)","v":185},{"$f":"VLOOKUP($A6,datos!$A$4:$AD$52,26)","v":173},{"$f":"VLOOKUP($A6,datos!$A$4:$AD$52,27)","v":213},{"$f":"SUM(D6:I6)","v":1135},{"$f":"J10","v":4631},{"$f":"(COUNTIF(D6:I6,\">0\"))","v":6},{"$f":"J6/L6","v":189.16666666666666}]
["j25",{"$f":"VLOOKUP($A7,datos!$A$4:$AD$52,2)","v":"SEBASTIAN DONADO"},{"$f":"VLOOKUP($A7,datos!$A$4:$AD$52,3)","v":"Colombia"},{"$f":"VLOOKUP($A7,datos!$A$4:$AD$52,22)","v":170},{"$f":"VLOOKUP($A7,datos!$A$4:$AD$52,23)","v":160},{"$f":"VLOOKUP($A7,datos!$A$4:$AD$52,24)","v":168},{"$f":"VLOOKUP($A7,datos!$A$4:$AD$52,25)","v":175},{"$f":"VLOOKUP($A7,datos!$A$4:$AD$52,26)","v":206},{"$f":"VLOOKUP($A7,datos!$A$4:$AD$52,27)","v":210},{"$f":"SUM(D7:I7)","v":1089},{"$f":"J10","v":4631},{"$f":"(COUNTIF(D7:I7,\">0\"))","v":6},{"$f":"J7/L7","v":181.5},"dif"]
["j26",{"$f":"VLOOKUP($A8,datos!$A$4:$AD$52,2)","v":"SEBASTIAN CHARRY"},{"$f":"VLOOKUP($A8,datos!$A$4:$AD$52,3)","v":"Colombia"},{"$f":"VLOOKUP($A8,datos!$A$4:$AD$52,22)","v":215},{"$f":"VLOOKUP($A8,datos!$A$4:$AD$52,23)","v":176},{"$f":"VLOOKUP($A8,datos!$A$4:$AD$52,24)","v":178},{"$f":"VLOOKUP($A8,datos!$A$4:$AD$52,25)","v":203},{"$f":"VLOOKUP($A8,datos!$A$4:$AD$52,26)","v":224},{"$f":"VLOOKUP($A8,datos!$A$4:$AD$52,27)","v":186},{"$f":"SUM(D8:I8)","v":1182},{"$f":"J10","v":4631},{"$f":"(COUNTIF(D8:I8,\">0\"))","v":6},{"$f":"J8/L8","v":197},{"$f":"MAX($J$45,$J$38,$J$31,$J$17,$J$10,$J$24,$J$52)-J10","v":0}]
["j27",{"$f":"VLOOKUP($A9,datos!$A$4:$AD$52,2)","v":"JORGE FIGUEROA"},{"$f":"VLOOKUP($A9,datos!$A$4:$AD$52,3)","v":"Colombia"},{"$f":"VLOOKUP($A9,datos!$A$4:$AD$52,22)","v":152},{"$f":"VLOOKUP($A9,datos!$A$4:$AD$52,23)","v":224},{"$f":"VLOOKUP($A9,datos!$A$4:$AD$52,24)","v":183},{"$f":"VLOOKUP($A9,datos!$A$4:$AD$52,25)","v":226},{"$f":"VLOOKUP($A9,datos!$A$4:$AD$52,26)","v":236},{"$f":"VLOOKUP($A9,datos!$A$4:$AD$52,27)","v":204},{"$f":"SUM(D9:I9)","v":1225},{"$f":"J10","v":4631},{"$f":"(COUNTIF(D9:I9,\">0\"))","v":6},{"$f":"J9/L9","v":204.16666666666666},"1°"]
[null,null,null,{"$f":"SUM(D6:D9)","v":701},727,762,789,839,813,4631,{"$f":"J10","v":4631},{"$f":"(COUNTIF(D10:I10,\">0\"))*6","v":36},{"$f":"J10/L10","v":128.63888888888889},null,null,{"$f":"MAX(D10:I10)","v":839}]
{"$rows_left_out":51}
{"sheet":"T EVENTO","index":5,"n_rows":55,"n_cols":36,"rows_kept":55,"cut":false,"hidden":false,"merged":[[4,3,4,9],[4,10,4,16],[4,24,4,30],[4,17,4,23],[1,0,1,34],[2,0,2,34],[3,0,3,34]]}
[]
["CAMPEONATO SUDAMERICANO JUVENIL 2014"]
["TODO EVENTO INDIVIDUAL"]
["SANTIAGO DE CHILE - DEL 12 AL 18 DE ABRIL DE 2014"]
[null,null,null,"INDIVIDUAL",null,null,null,null,null,null,"PAREJAS",null,null,null,null,null,null,"TERCETOS",null,null,null,null,null,null,"CUARTETOS"]
["Cod","Nombre del Jugador","FEDERACION","L1","L2","L3","L4","L5","L6","Serie","L7","L8","L9","L10","L11","L12","Serie","L13","L14","L15","L16","L17","L18","Serie","L19","L20","L21","L22","L23","L24","Serie","L","Total","Prom","Pos.","dif"]
["J20",{"$f":"VLOOKUP($A7,datos!$A$4:$AD$52,2)","v":"BRUNO COSTA S"},{"$f":"VLOOKUP($A7,datos!$A$4:$AD$52,3)","v":"Brasil"},{"$f":"VLOOKUP($A7,datos!$A$4:$AD$52,4)","v":202},{"$f":"VLOOKUP($A7,datos!$A$4:$AD$52,5)","v":265},{"$f":"VLOOKUP($A7,datos!$A$4:$AD$52,6)","v":214},{"$f":"VLOOKUP($A7,datos!$A$4:$AD$52,7)","v":185},{"$f":"VLOOKUP($A7,datos!$A$4:$AD$52,8)","v":211},{"$f":"VLOOKUP($A7,datos!$A$4:$AD$52,9)","v":233},{"$f":"SUM(D7:I7)","v":1310},{"$f":"VLOOKUP($A7,datos!$A$4:$AD$52,10)","v":178},{"$f":"VLOOKUP($A7,datos!$A$4:$AD$52,11)","v":200},{"$f":"VLOOKUP($A7,datos!$A$4:$AD$52,12)","v":213},{"$f":"VLOOKUP($A7,datos!$A$4:$AD$52,13)","v":210},{"$f":"VLOOKUP($A7,datos!$A$4:$AD$52,14)","v":202},{"$f":"VLOOKUP($A7,datos!$A$4:$AD$52,15)","v":247},{"$f":"SUM(K7:P7)","v":1250},{"$f":"VLOOKUP($A7,datos!$A$4:$AD$52,16)","v":182},{"$f":"VLOOKUP($A7,datos!$A$4:$AD$52,17)","v":277},{"$f":"VLOOKUP($A7,datos!$A$4:$AD$52,18)","v":225},{"$f":"VLOOKUP($A7,datos!$A$4:$AD$52,19)","v":254},{"$f":"VLOOKUP($A7,datos!$A$4:$AD$52,20)","v":267},{"$f":"VLOOKUP($A7,datos!$A$4:$AD$52,21)","v":213},{"$f":"SUM(R7:W7)","v":1418},{"$f":"VLOOKUP($A7,datos!$A$4:$AD$52,22)","v":221},{"$f":"VLOOKUP($A7,datos!$A$4:$AD$52,23)","v":190},{"$f":"VLOOKUP($A7,datos!$A$4:$AD$52,24)","v":222},{"$f":"VLOOKUP($A7,datos!$A$4:$AD$52,25)","v":162},{"$f":"VLOOKUP($A7,datos!$A$4:$AD$52,26)","v":172},{"$f":"VLOOKUP($A7,datos!$A$4:$AD$52,27)","v":203},{"$f":"SUM(Y7:AD7)","v":1170},{"$f":"VLOOKUP($A7,datos!$A$4:$AD$52,28)","v":24},{"$f":"VLOOKUP($A7,datos!$A$4:$AD$52,29)","v":5148},{"$f":"AG7/AF7","v":214.5},"1º",{"$f":"MAX($AG$7:$AG$51)-AG7","v":{"$error":"#N/A"}}]
["J27",{"$f":"VLOOKUP($A8,datos!$A$4:$AD$52,2)","v":"JORGE FIGUEROA"},{"$f":"VLOOKUP($A8,datos!$A$4:$AD$52,3)","v":"Colombia"},{"$f":"VLOOKUP($A8,datos!$A$4:$AD$52,4)","v":216},{"$f":"VLOOKUP($A8,datos!$A$4:$AD$52,5)","v":214},{"$f":"VLOOKUP($A8,datos!$A$4:$AD$52,6)","v":224},{"$f":"VLOOKUP($A8,datos!$A$4:$AD$52,7)","v":233},{"$f":"VLOOKUP($A8,datos!$A$4:$AD$52,8)","v":169},{"$f":"VLOOKUP($A8,datos!$A$4:$AD$52,9)","v":207},1263,{"$f":"VLOOKUP($A8,datos!$A$4:$AD$52,10)","v":242},{"$f":"VLOOKUP($A8,datos!$A$4:$AD$52,11)","v":148},{"$f":"VLOOKUP($A8,datos!$A$4:$AD$52,12)","v":216},{"$f":"VLOOKUP($A8,datos!$A$4:$AD$52,13)","v":212},{"$f":"VLOOKUP($A8,datos!$A$4:$AD$52,14)","v":184},{"$f":"VLOOKUP($A8,datos!$A$4:$AD$52,15)","v":175},1177,{"$f":"VLOOKUP($A8,datos!$A$4:$AD$52,16)","v":219},{"$f":"VLOOKUP($A8,datos!$A$4:$AD$52,17)","v":175},{"$f":"VLOOKUP($A8,datos!$A$4:$AD$52,18)","v":223},{"$f":"VLOOKUP($A8,datos!$A$4:$AD$52,19)","v":243},{"$f":"VLOOKUP($A8,datos!$A$4:$AD$52,20)","v":214},{"$f":"VLOOKUP($A8,datos!$A$4:$AD$52,21)","v":182},1256,{"$f":"VLOOKUP($A8,datos!$A$4:$AD$52,22)","v":152},{"$f":"VLOOKUP($A8,datos!$A$4:$AD$52,23)","v":224},{"$f":"VLOOKUP($A8,datos!$A$4:$AD$52,24)","v":183},{"$f":"VLOOKUP($A8,datos!$A$4:$AD$52,25)","v":226},{"$f":"VLOOKUP($A8,datos!$A$4:$AD$52,26)","v":236},{"$f":"VLOOKUP($A8,datos!$A$4:$AD$52,27)","v":204},1225,{"$f":"VLOOKUP($A8,datos!$A$4:$AD$52,28)","v":24},{"$f":"VLOOKUP($A8,datos!$A$4:$AD$52,29)","v":4921},205.04166666666666,"2º",{"$error":"#N/A"}]
["J26",{"$f":"VLOOKUP($A9,datos!$A$4:$AD$52,2)","v":"SEBASTIAN CHARRY"},{"$f":"VLOOKUP($A9,datos!$A$4:$AD$52,3)","v":"Colombia"},{"$f":"VLOOKUP($A9,datos!$A$4:$AD$52,4)","v":223},{"$f":"VLOOKUP($A9,datos!$A$4:$AD$52,5)","v":223},{"$f":"VLOOKUP($A9,datos!$A$4:$AD$52,6)","v":162},{"$f":"VLOOKUP($A9,datos!$A$4:$AD$52,7)","v":246},{"$f":"VLOOKUP($A9,datos!$A$4:$AD$52,8)","v":227},{"$f":"VLOOKUP($A9,datos!$A$4:$AD$52,9)","v":257},1338,{"$f":"VLOOKUP($A9,datos!$A$4:$AD$52,10)","v":225},{"$f":"VLOOKUP($A9,datos!$A$4:$AD$52,11)","v":199},{"$f":"VLOOKUP($A9,datos!$A$4:$AD$52,12)","v":174},{"$f":"VLOOKUP($A9,datos!$A$4:$AD$52,13)","v":169},{"$f":"VLOOKUP($A9,datos!$A$4:$AD$52,14)","v":191},{"$f":"VLOOKUP($A9,datos!$A$4:$AD$52,15)","v":195},1153,{"$f":"VLOOKUP($A9,datos!$A$4:$AD$52,16)","v":168},{"$f":"VLOOKUP($A9,datos!$A$4:$AD$52,17)","v":239},{"$f":"VLOOKUP($A9,datos!$A$4:$AD$52,18)","v":211},{"$f":"VLOOKUP($A9,datos!$A$4:$AD$52,19)","v":216},{"$f":"VLOOKUP($A9,datos!$A$4:$AD$52,20)","v":198},{"$f":"VLOOKUP($A9,datos!$A$4:$AD$52,21)","v":193},1225,{"$f":"VLOOKUP($A9,datos!$A$4:$AD$52,22)","v":215},{"$f":"VLOOKUP($A9,datos!$A$4:$AD$52,23)","v":176},{"$f":"VLOOKUP($A9,datos!$A$4:$AD$52,24)","v":178},{"$f":"VLOOKUP($A9,datos!$A$4:$AD$52,25)","v":203},{"$f":"VLOOKUP($A9,datos!$A$4:$AD$52,26)","v":224},{"$f":"VLOOKUP($A9,datos!$A$4:$AD$52,27)","v":186},1182,{"$f":"VLOOKUP($A9,datos!$A$4:$AD$52,28)","v":24},{"$f":"VLOOKUP($A9,datos!$A$4:$AD$52,29)","v":4898},204.08333333333334,"3º",{"$error":"#N/A"}]
["J16",{"$f":"VLOOKUP($A10,datos!$A$4:$AD$52,2)","v":"BRIAN HELMEYER"},{"$f":"VLOOKUP($A10,datos!$A$4:$AD$52,3)","v":"Aruba"},{"$f":"VLOOKUP($A10,datos!$A$4:$AD$52,4)","v":176},{"$f":"VLOOKUP($A10,datos!$A$4:$AD$52,5)","v":217},{"$f":"VLOOKUP($A10,datos!$A$4:$AD$52,6)","v":155},{"$f":"VLOOKUP($A10,datos!$A$4:$AD$52,7)","v":238},{"$f":"VLOOKUP($A10,datos!$A$4:$AD$52,8)","v":174},{"$f":"VLOOKUP($A10,datos!$A$4:$AD$52,9)","v":192},1152,{"$f":"VLOOKUP($A10,datos!$A$4:$AD$52,10)","v":177},{"$f":"VLOOKUP($A10,datos!$A$4:$AD$52,11)","v":172},{"$f":"VLOOKUP($A10,datos!$A$4:$AD$52,12)","v":193},{"$f":"VLOOKUP($A10,datos!$A$4:$AD$52,13)","v":200},{"$f":"VLOOKUP($A10,datos!$A$4:$AD$52,14)","v":235},{"$f":"VLOOKUP($A10,datos!$A$4:$AD$52,15)","v":184},1161,{"$f":"VLOOKUP($A10,datos!$A$4:$AD$52,16)","v":227},{"$f":"VLOOKUP($A10,datos!$A$4:$AD$52,17)","v":245},{"$f":"VLOOKUP($A10,datos!$A$4:$AD$52,18)","v":187},{"$f":"VLOOKUP($A10,datos!$A$4:$AD$52,19)","v":197},{"$f":"VLOOKUP($A10,datos!$A$4:$AD$52,20)","v":211},{"$f":"VLOOKUP($A10,datos!$A$4:$AD$52,21)","v":167},1234,{"$f":"VLOOKUP($A10,datos!$A$4:$AD$52,22)","v":185},{"$f":"VLOOKUP($A10,datos!$A$4:$AD$52,23)","v":233},{"$f":"VLOOKUP($A10,datos!$A$4:$AD$52,24)","v":188},{"$f":"VLOOKUP($A10,datos!$A$4:$AD$52,25)","v":185},{"$f":"VLOOKUP($A10,datos!$A$4:$AD$52,26)","v":203},{"$f":"VLOOKUP($A10,datos!$A$4:$AD$52,27)","v":188},1182,{"$f":"VLOOKUP($A10,datos!$A$4:$AD$52,28)","v":24},{"$f":"VLOOKUP($A10,datos!$A$4:$AD$52,29)","v":4729},197.04166666666666,"4º",{"$error":"#N/A"}]
{"$rows_left_out":46}
{"sheet":"EVENTO PAIS","index":6,"n_rows":45,"n_cols":8,"rows_kept":45,"cut":false,"hidden":false,"merged":[[41,6,44,6],[41,7,44,7],[11,6,14,6],[11,7,14,7],[17,6,20,6],[17,7,20,7],[23,6,26,6],[23,7,26,7],[29,6,32,6],[29,7,32,7],[35,6,38,6],[35,7,38,7],[1,0,1,7],[2,0,2,7],[5,6,8,6],[5,7,8,7],[3,1,3,7]]}
[]
["    CAMPEONATO SUDAMERICANO JUVENIL 2014"]
["TODO EVENTO PAIS"]
[]
["Cod","Nombre del Jugador","FEDERACION","TOTAL PALOS","PROM IND",{"$f":"G6","v":19061},"TOTAL EQ","PROM EQ"]
["j24",{"$f":"VLOOKUP($A6,datos!$A$4:$AD$52,2)","v":"CARLOS F. SAAVEDRA"},{"$f":"VLOOKUP($A6,datos!$A$4:$AD$52,3)","v":"Colombia"},{"$f":"VLOOKUP($A6,datos!$A$4:$AD$52,29)","v":4636},{"$f":"D6/24","v":193.16666666666666},{"$f":"G6","v":19061},{"$f":"SUM(D6:D9)","v":19061},{"$f":"SUM(E6:E9)/4","v":198.55208333333331}]
["j25",{"$f":"VLOOKUP($A7,datos!$A$4:$AD$52,2)","v":"SEBASTIAN DONADO"},{"$f":"VLOOKUP($A7,datos!$A$4:$AD$52,3)","v":"Colombia"},{"$f":"VLOOKUP($A7,datos!$A$4:$AD$52,29)","v":4606},{"$f":"D7/24","v":191.91666666666666},{"$f":"G6","v":19061}]
["j26",{"$f":"VLOOKUP($A8,datos!$A$4:$AD$52,2)","v":"SEBASTIAN CHARRY"},{"$f":"VLOOKUP($A8,datos!$A$4:$AD$52,3)","v":"Colombia"},{"$f":"VLOOKUP($A8,datos!$A$4:$AD$52,29)","v":4898},{"$f":"D8/24","v":204.08333333333334},{"$f":"G6","v":19061}]
["j27",{"$f":"VLOOKUP($A9,datos!$A$4:$AD$52,2)","v":"JORGE FIGUEROA"},{"$f":"VLOOKUP($A9,datos!$A$4:$AD$52,3)","v":"Colombia"},{"$f":"VLOOKUP($A9,datos!$A$4:$AD$52,29)","v":4921},{"$f":"D9/24","v":205.04166666666666},{"$f":"G6","v":19061}]
[null,null,null,null,null,{"$f":"G6","v":19061}]
{"$rows_left_out":36}
{"sheet":"ROUND ROBIN","index":7,"n_rows":33,"n_cols":21,"rows_kept":33,"cut":false,"hidden":false,"merged":[[0,0,2,0],[0,1,0,15],[0,16,2,20],[1,1,1,15],[2,1,2,15],[25,7,27,9],[28,3,28,5],[28,11,28,13],[28,15,28,20],[24,3,24,5],[24,11,24,13],[24,15,24,20],[33,0,33,1],[30,2,30,3],[30,5,30,9],[31,0,31,1],[32,2,32,3],[32,5,32,9]]}
[null,"CAMPEONATO SUDAMERICANO JUVENIL 2014"]
[null,"SANTIAGO DE CHILE DEL 12 AL 18 DE ABRIL D 2014"]
[null,"FINAL MASTER SUB 20"]
["DEPORTISTA","PAÍS","TODO EVENTO","LÍNEA 1","BONIF","LÍNEA 2","BONIF","LÍNEA 3","BONIF","LÍNEA 4","BONIF","LÍNEA 5","BONIF","LÍNEA 6","BONIF","LÍNEA 7","BONIF ","TOTAL","Prom s/bonif","DIF.","POSICIÓN"]
["BRUNO SOARES COSTA","Brasil",5148,152,0,230,20,179,0,227,20,224,20,204,20,226,20,{"$f":"D5+E5+F5+G5+H5+I5+J5+K5+L5+M5+N5+O5+P5+Q5+C5","v":6690},null,{"$f":"R5-R5","v":0},"1°"]
["JORGE FIGUEROA","Colombia",4921,224,20,226,20,225,20,215,0,195,0,194,0,277,20,6557,null,{"$f":"R5-R6","v":133},"2°"]
["SEBASTIAN CHARRY","Colombia",4898,212,20,219,0,212,0,228,20,194,0,224,20,224,20,6491,null,{"$f":"R5-R7","v":199},"3°"]
["CARLOS F. SAAVEDRA","Colombia",4636,220,20,182,10,216,20,244,20,254,20,183,20,191,20,6256,null,{"$f":"R5-R8","v":434},"4°"]
["SEBASTIAN DONADO","Colombia",4606,184,0,247,20,186,20,215,20,199,20,157,0,215,20,6109,null,{"$f":"R5-R9","v":581},"5°"]
["FRANCO R. GUALINI","Argentina",4564,165,20,222,0,223,0,190,20,248,20,174,20,214,20,6100,null,{"$f":"R5-R10","v":590},"6°"]
{"$rows_left_out":23}