{"text_format":"1","workbook":"xlsx","n_sheets":6,"sheets":["datos","IND.","PAR","T EVENTO","EVENTO PAIS","Round Robin y Master"],"not_rendered":{"charts":0,"images":6,"macros":1,"external_links":0,"defined_names":7,"comments":0,"pivot_tables":0},"unopened":[],"bounds":{"document_bytes":16777216,"sheet_cells":100000,"rows_first":2000,"rows_last":500,"rows_between":2000,"halvings":0,"cell_chars":16384,"cell_head_chars":4096},"cells_cut":0,"cells_raw":0,"read":"whole","date_system":"1900"}

{"sheet":"datos","index":0,"n_rows":53,"n_cols":30,"rows_kept":53,"cut":false,"hidden":true,"merged":[]}
[null,"solamente carga de datos"]
[null,null,null,null,null,null,null,null,null,null,null,null,null,null,null,null,null," "]
[null,"Apellido y Nombre","FEDE","L1","L2","L3","L4","L5","L6","L7","L8","L9","L10","L11","L12","L13","L14","L15","L16","L17","L18","L19","L20","L21","L22","L23","L24","LIN","TOTAL","PROM"]
["J01","JUAN IGNACIO ALI","Argentina",171,182,177,157,160,202,179,166,170,180,190,180,162,182,168,167,201,155,175,163,167,166,173,216,{"$f":"COUNTIF(D4:AA4,\">0\")","v":24},{"$f":"SUM(D4:AA4)","v":4209},{"$f":"AC4/AB4","v":175.375}]
["J02","JAIR KELLY","Aruba",118,147,188,211,199,146,204,141,124,232,166,162,121,134,158,237,199,200,179,216,169,192,187,227,24,4257,{"$f":"AC5/AB5","v":177.375}]
["J03","RENALD THIEL","Aruba",213,160,173,214,194,202,204,191,221,187,188,170,170,150,192,201,229,157,108,158,175,206,200,143,24,4406,183.58333333333334]
["J04","SEBASTIAN SALAZAR","Colombia",213,222,159,211,233,145,194,170,203,211,158,180,256,278,204,194,238,178,218,168,201,190,158,218,24,4800,200]
["J05","MAURICIO CABRERA","Colombia",257,212,213,188,191,161,191,190,171,190,228,180,189,227,235,187,222,213,232,181,216,224,233,175,24,4906,204.41666666666666]
["J06","SEBASTIAN VICENCIO R","Chile",121,94,111,125,119,132,152,131,148,145,130,130,100,103,89,127,163,169,122,97,142,147,132,100,24,3029,126.20833333333333]
["J07","EDUARDO MARTINEZ G","Chile",136,146,136,165,137,134,110,115,120,162,132,154,177,158,122,134,127,155,164,130,131,125,165,184,24,3419,142.45833333333334]
["J08","ALEJANDRO ISHIKAWA","Perú",166,179,214,188,228,195,141,237,165,179,160,170,233,204,222,211,180,187,144,258,178,162,290,161,24,4652,193.83333333333334]
["J09","SEBASTIAN YUZURIHA","Perú",155,168,201,264,277,205,189,200,153,182,168,184,206,188,171,211,219,199,227,152,169,213,223,242,24,4766,198.58333333333334]
["J10","FRANCO GARCIA D.","Uruguay",149,142,155,114,136,166,201,135,128,170,165,178,221,167,199,190,146,136,175,144,131,166,150,188,24,3852,160.5]
["J11","JOAQUIN MANRIQUE D.","Uruguay",147,129,163,146,170,166,165,184,156,123,195,170,236,158,165,140,183,169,165,183,184,179,126,138,24,3940,164.16666666666666]
[null,null,null,null,null,null,null,null,null,null,null,null,null,null,null,null,null,null,null,null,null,null,null,null,null,null,null,0,0,{"$error":"#DIV/0!"}]
[null,null,null,null,null,null,null,null,null,null,null,null,null,null,null,null,null,null,null,null,null,null,null,null,null,null,null,0,0,{"$error":"#DIV/0!"}]
[null,null,null,null,null,null,null,null,null,null,null,null,null,null,null,null,null,null,null,null,null,null,null,null,null,null,null,0,0,{"$error":"#DIV/0!"}]
[null,null,null,null,null,null,null,null,null,null,null,null,null,null,null,null,null,null,null,null,null,null,null,null,null,null,null,0,0,{"$error":"#DIV/0!"}]
[null,null,null,null,null,null,null,null,null,null,null,null,null,null,null,null,null,null,null,null,null,null,null,null,null,null,null,0,0,{"$error":"#DIV/0!"}]
[null,null,null,null,null,null,null,null,null,null,null,null,null,null,null,null,null,null,null,null,null,null,null,null,null,null,null,0,0,{"$error":"#DIV/0!"}]
[null,null,null,null,null,null,null,null,null,null,null,null,null,null,null,null,null,null,null,null,null,null,null,null,null,null,null,0,0,{"$error":"#DIV/0!"}]
[null,null,null,null,null,null,null,null,null,null,null,null,null,null,null,null,null,null,null,null,null,null,null,null,null,null,null,0,0,{"$error":"#DIV/0!"}]
[null,null,null,null,null,null,null,null,null,null,null,null,null,null,null,null,null,null,null,null,null,null,null,null,null,null,null,0,0,{"$error":"#DIV/0!"}]
[null,null,null,null,null,null,null,null,null,null,null,null,null,null,null,null,null,null,null,null,null,null,null,null,null,null,null,0,0,{"$error":"#DIV/0!"}]
[null,null,null,null,null,null,null,null,null,null,null,null,null,null,null,null,null,null,null,null,null,null,null,null,null,null,null,0,0,{"$error":"#DIV/0!"}]
[null,null,null,null,null,null,null,null,null,null,null,null,null,null,null,null,null,null,null,null,null,null,null,null,null,null,null,0,0,{"$error":"#DIV/0!"}]
[null,null,null,null,null,null,null,null,null,null,null,null,null,null,null,null,null,null,null,null,null,null,null,null,null,null,null,0,0,{"$error":"#DIV/0!"}]
[null,null,null,null,null,null,null,null,null,null,null,null,null,null,null,null,null,null,null,null,null,null,null,null,null,null,null,0,0,{"$error":"#DIV/0!"}]
[null,null,null,null,null,null,null,null,null,null,null,null,null,null,null,null,null,null,null,null,null,null,null,null,null,null,null,0,0,{"$error":"#DIV/0!"}]
[null,null,null,null,null,null,null,null,null,null,null,null,null,null,null,null,null,null,null,null,null,null,null,null,null,null,null,0,0,{"$error":"#DIV/0!"}]
[null,null,null,null,null,null,null,null,null,null,null,null,null,null,null,null,null,null,null,null,null,null,null,null,null,null,null,0,0,{"$error":"#DIV/0!"}]
[null,null,null,null,null,null,null,null,null,null,null,null,null,null,null,null,null,null,null,null,null,null,null,null,null,null,null,0,0,{"$error":"#DIV/0!"}]
[null,null,null,null,null,null,null,null,null,null,null,null,null,null,null,null,null,null,null,null,null,null,null,null,null,null,null,0,0,{"$error":"#DIV/0!"}]
[null,null,null,null,null,null,null,null,null,null,null,null,null,null,null,null,null,null,null,null,null,null,null,null,null,null,null,0,0,{"$error":"#DIV/0!"}]
[null,null,null,null,null,null,null,null,null,null,null,null,null,null,null,null,null,null,null,null,null,null,null,null,null,null,null,0,0,{"$error":"#DIV/0!"}]
[null,null,null,null,null,null,null,null,null,null,null,null,null,null,null,null,null,null,null,null,null,null,null,null,null,null,null,0,0,{"$error":"#DIV/0!"}]
[null,null,null,null,null,null,null,null,null,null,null,null,null,null,null,null,null,null,null,null,null,null,null,null,null,null,null,0,0,{"$error":"#DIV/0!"}]
[null,null,null,null,null,null,null,null,null,null,null,null,null,null,null,null,null,null,null,null,null,null,null,null,null,null,null,{"$f":"COUNTIF(D38:AA38,\">0\")","v":0},{"$f":"SUM(D38:AA38)","v":0},{"$error":"#DIV/0!"}]
[null,null,null,null,null,null,null,null,null,null,null,null,null,null,null,null,null,null,null,null,null,null,null,null,null,null,null,0,0,{"$error":"#DIV/0!"}]
[null,null,null,null,null,null,null,null,null,null,null,null,null,null,null,null,null,null,null,null,null,null,null,null,null,null,null,0,0,{"$error":"#DIV/0!"}]
[null,null,null,null,null,null,null,null,null,null,null,null,null,null,null,null,null,null,null,null,null,null,null,null,null,null,null,0,0,{"$error":"#DIV/0!"}]
[null,null,null,null,null,null,null,null,null,null,null,null,null,null,null,null,null,null,null,null,null,null,null,null,null,null,null,0,0,{"$error":"#DIV/0!"}]
[null,null,null,null,null,null,null,null,null,null,null,null,null,null,null,null,null,null,null,null,null,null,null,null,null,null,null,0,0,{"$error":"#DIV/0!"}]
[null,null,null,null,null,null,null,null,null,null,null,null,null,null,null,null,null,null,null,null,null,null,null,null,null,null,null,0,0,{"$error":"#DIV/0!"}]
[null,null,null,null,null,null,null,null,null,null,null,null,null,null,null,null,null,null,null,null,null,null,null,null,null,null,null,0,0,{"$error":"#DIV/0!"}]
[null,null,null,null,null,null,null,null,null,null,null,null,null,null,null,null,null,null,null,null,null,null,null,null,null,null,null,0,0,{"$error":"#DIV/0!"}]
[null,null,null,null,null,null,null,null,null,null,null,null,null,null,null,null,null,null,null,null,null,null,null,null,null,null,null,0,0,{"$error":"#DIV/0!"}]
[null,null,null,null,null,null,null,null,null,null,null,null,null,null,null,null,null,null,null,null,null,null,null,null,null,null,null,0,0,{"$error":"#DIV/0!"}]
[null,null,null,null,null,null,null,null,null,null,null,null,null,null,null,null,null,null,null,null,null,null,null,null,null,null,null,0,0,{"$error":"#DIV/0!"}]
[null,null,null,null,null,null,null,null,null,null,null,null,null,null,null,null,null,null,null,null,null,null,null,null,null,null,null,0,0,{"$error":"#DIV/0!"}]
[null,null,null,null,null,null,null,null,null,null,null,null,null,null,null,null,null,null,null,null,null,null,null,null,null,null,null,{"$f":"COUNTIF(D51:AA51,\">0\")","v":0},{"$f":"SUM(D51:AA51)","v":0},{"$f":"AC51/AB51","v":{"$error":"#DIV/0!"}}]
[null,null,null,null,null,null,null,null,null,null,null,null,null,null,null,null,null,null,null,null,null,null,null,null,null,null,null,0,0,{"$error":"#DIV/0!"}]
[1,2,3,4,5,6,7,8,9,10,11,12,13,14,15,16,17,18,19,20,21,22,23,24,25,26,27,28,29,30]

{"sheet":"IND.","index":1,"n_rows":16,"n_cols":20,"rows_kept":16,"cut":false,"hidden":false,"merged":[[3,1,3,19],[1,0,1,19],[2,0,2,19]]}
[]
["CAMPEONATO SUDAMERICANO JUVENIL 2014"]
["INDVIDUAL SUB 16"]
[]
["Cod","Nombre del Jugador","FEDERACION","L1","L2","L3","L4","L5","L6","L7","L8","L9","L10","L11","L12","total","lin","Prom","Pos.","dif"]
["J05",{"$f":"VLOOKUP($A6,datos!$A$4:$AD$52,2)","v":"MAURICIO CABRERA"},{"$f":"VLOOKUP($A6,datos!$A$4:$AD$52,3)","v":"Colombia"},{"$f":"VLOOKUP($A6,datos!$A$4:$AD$52,4)","v":257},{"$f":"VLOOKUP($A6,datos!$A$4:$AD$52,5)","v":212},{"$f":"VLOOKUP($A6,datos!$A$4:$AD$52,6)","v":213},{"$f":"VLOOKUP($A6,datos!$A$4:$AD$52,7)","v":188},{"$f":"VLOOKUP($A6,datos!$A$4:$AD$52,8)","v":191},{"$f":"VLOOKUP($A6,datos!$A$4:$AD$52,9)","v":161},{"$f":"VLOOKUP($A6,datos!$A$4:$AD$52,10)","v":191},{"$f":"VLOOKUP($A6,datos!$A$4:$AD$52,11)","v":190},{"$f":"VLOOKUP($A6,datos!$A$4:$AD$52,12)","v":171},{"$f":"VLOOKUP($A6,datos!$A$4:$AD$52,13)","v":190},{"$f":"VLOOKUP($A6,datos!$A$4:$AD$52,14)","v":228},{"$f":"VLOOKUP($A6,datos!$A$4:$AD$52,15)","v":180},{"$f":"SUM(D6:O6)","v":2372},{"$f":"COUNTIF(D6:O6,\">0\")","v":12},{"$f":"P6/Q6","v":197.66666666666666},"1º",{"$f":"MAX($P$6:$P$16)-P6","v":0}]
["J09",{"$f":"VLOOKUP($A7,datos!$A$4:$AD$52,2)","v":"SEBASTIAN YUZURIHA"},{"$f":"VLOOKUP($A7,datos!$A$4:$AD$52,3)","v":"Perú"},{"$f":"VLOOKUP($A7,datos!$A$4:$AD$52,4)","v":155},{"$f":"VLOOKUP($A7,datos!$A$4:$AD$52,5)","v":168},{"$f":"VLOOKUP($A7,datos!$A$4:$AD$52,6)","v":201},{"$f":"VLOOKUP($A7,datos!$A$4:$AD$52,7)","v":264},{"$f":"VLOOKUP($A7,datos!$A$4:$AD$52,8)","v":277},{"$f":"VLOOKUP($A7,datos!$A$4:$AD$52,9)","v":205},{"$f":"VLOOKUP($A7,datos!$A$4:$AD$52,10)","v":189},{"$f":"VLOOKUP($A7,datos!$A$4:$AD$52,11)","v":200},{"$f":"VLOOKUP($A7,datos!$A$4:$AD$52,12)","v":153},{"$f":"VLOOKUP($A7,datos!$A$4:$AD$52,13)","v":182},{"$f":"VLOOKUP($A7,datos!$A$4:$AD$52,14)","v":168},{"$f":"VLOOKUP($A7,datos!$A$4:$AD$52,15)","v":184},2346,{"$f":"COUNTIF(D7:O7,\">0\")","v":12},{"$f":"P7/Q7","v":195.5},"2º",26]
["J03",{"$f":"VLOOKUP($A8,datos!$A$4:$AD$52,2)","v":"RENALD THIEL"},{"$f":"VLOOKUP($A8,datos!$A$4:$AD$52,3)","v":"Aruba"},{"$f":"VLOOKUP($A8,datos!$A$4:$AD$52,4)","v":213},{"$f":"VLOOKUP($A8,datos!$A$4:$AD$52,5)","v":160},{"$f":"VLOOKUP($A8,datos!$A$4:$AD$52,6)","v":173},{"$f":"VLOOKUP($A8,datos!$A$4:$AD$52,7)","v":214},{"$f":"VLOOKUP($A8,datos!$A$4:$AD$52,8)","v":194},{"$f":"VLOOKUP($A8,datos!$A$4:$AD$52,9)","v":202},{"$f":"VLOOKUP($A8,datos!$A$4:$AD$52,10)","v":204},{"$f":"VLOOKUP($A8,datos!$A$4:$AD$52,11)","v":191},{"$f":"VLOOKUP($A8,datos!$A$4:$AD$52,12)","v":221},{"$f":"VLOOKUP($A8,datos!$A$4:$AD$52,13)","v":187},{"$f":"VLOOKUP($A8,datos!$A$4:$AD$52,14)","v":188},{"$f":"VLOOKUP($A8,datos!$A$4:$AD$52,15)","v":170},2317,12,193.08333333333334,"3º",55]
["J04",{"$f":"VLOOKUP($A9,datos!$A$4:$AD$52,2)","v":"SEBASTIAN SALAZAR"},{"$f":"VLOOKUP($A9,datos!$A$4:$AD$52,3)","v":"Colombia"},{"$f":"VLOOKUP($A9,datos!$A$4:$AD$52,4)","v":213},{"$f":"VLOOKUP($A9,datos!$A$4:$AD$52,5)","v":222},{"$f":"VLOOKUP($A9,datos!$A$4:$AD$52,6)","v":159},{"$f":"VLOOKUP($A9,datos!$A$4:$AD$52,7)","v":211},{"$f":"VLOOKUP($A9,datos!$A$4:$AD$52,8)","v":233},{"$f":"VLOOKUP($A9,datos!$A$4:$AD$52,9)","v":145},{"$f":"VLOOKUP($A9,datos!$A$4:$AD$52,10)","v":194},{"$f":"VLOOKUP($A9,datos!$A$4:$AD$52,11)","v":170},{"$f":"VLOOKUP($A9,datos!$A$4:$AD$52,12)","v":203},{"$f":"VLOOKUP($A9,datos!$A$4:$AD$52,13)","v":211},{"$f":"VLOOKUP($A9,datos!$A$4:$AD$52,14)","v":158},{"$f":"VLOOKUP($A9,datos!$A$4:$AD$52,15)","v":180},2299,12,191.58333333333334,"4º",73]
["J08",{"$f":"VLOOKUP($A10,datos!$A$4:$AD$52,2)","v":"ALEJANDRO ISHIKAWA"},{"$f":"VLOOKUP($A10,datos!$A$4:$AD$52,3)","v":"Perú"},{"$f":"VLOOKUP($A10,datos!$A$4:$AD$52,4)","v":166},{"$f":"VLOOKUP($A10,datos!$A$4:$AD$52,5)","v":179},{"$f":"VLOOKUP($A10,datos!$A$4:$AD$52,6)","v":214},{"$f":"VLOOKUP($A10,datos!$A$4:$AD$52,7)","v":188},{"$f":"VLOOKUP($A10,datos!$A$4:$AD$52,8)","v":228},{"$f":"VLOOKUP($A10,datos!$A$4:$AD$52,9)","v":195},{"$f":"VLOOKUP($A10,datos!$A$4:$AD$52,10)","v":141},{"$f":"VLOOKUP($A10,datos!$A$4:$AD$52,11)","v":237},{"$f":"VLOOKUP($A10,datos!$A$4:$AD$52,12)","v":165},{"$f":"VLOOKUP($A10,datos!$A$4:$AD$52,13)","v":179},{"$f":"VLOOKUP($A10,datos!$A$4:$AD$52,14)","v":160},{"$f":"VLOOKUP($A10,datos!$A$4:$AD$52,15)","v":170},2222,12,185.16666666666666,"5º",150]
["J01",{"$f":"VLOOKUP($A11,datos!$A$4:$AD$52,2)","v":"JUAN IGNACIO ALI"},{"$f":"VLOOKUP($A11,datos!$A$4:$AD$52,3)","v":"Argentina"},{"$f":"VLOOKUP($A11,datos!$A$4:$AD$52,4)","v":171},{"$f":"VLOOKUP($A11,datos!$A$4:$AD$52,5)","v":182},{"$f":"VLOOKUP($A11,datos!$A$4:$AD$52,6)","v":177},{"$f":"VLOOKUP($A11,datos!$A$4:$AD$52,7)","v":157},{"$f":"VLOOKUP($A11,datos!$A$4:$AD$52,8)","v":160},{"$f":"VLOOKUP($A11,datos!$A$4:$AD$52,9)","v":202},{"$f":"VLOOKUP($A11,datos!$A$4:$AD$52,10)","v":179},{"$f":"VLOOKUP($A11,datos!$A$4:$AD$52,11)","v":166},{"$f":"VLOOKUP($A11,datos!$A$4:$AD$52,12)","v":170},{"$f":"VLOOKUP($A11,datos!$A$4:$AD$52,13)","v":180},{"$f":"VLOOKUP($A11,datos!$A$4:$AD$52,14)","v":190},{"$f":"VLOOKUP($A11,datos!$A$4:$AD$52,15)","v":180},2114,12,176.16666666666666,"6º",258]
["J02",{"$f":"VLOOKUP($A12,datos!$A$4:$AD$52,2)","v":"JAIR KELLY"},{"$f":"VLOOKUP($A12,datos!$A$4:$AD$52,3)","v":"Aruba"},{"$f":"VLOOKUP($A12,datos!$A$4:$AD$52,4)","v":118},{"$f":"VLOOKUP($A12,datos!$A$4:$AD$52,5)","v":147},{"$f":"VLOOKUP($A12,datos!$A$4:$AD$52,6)","v":188},{"$f":"VLOOKUP($A12,datos!$A$4:$AD$52,7)","v":211},{"$f":"VLOOKUP($A12,datos!$A$4:$AD$52,8)","v":199},{"$f":"VLOOKUP($A12,datos!$A$4:$AD$52,9)","v":146},{"$f":"VLOOKUP($A12,datos!$A$4:$AD$52,10)","v":204},{"$f":"VLOOKUP($A12,datos!$A$4:$AD$52,11)","v":141},{"$f":"VLOOKUP($A12,datos!$A$4:$AD$52,12)","v":124},{"$f":"VLOOKUP($A12,datos!$A$4:$AD$52,13)","v":232},{"$f":"VLOOKUP($A12,datos!$A$4:$AD$52,14)","v":166},{"$f":"VLOOKUP($A12,datos!$A$4:$AD$52,15)","v":162},2038,12,169.83333333333334,"7º",334]
["J11",{"$f":"VLOOKUP($A13,datos!$A$4:$AD$52,2)","v":"JOAQUIN MANRIQUE D."},{"$f":"VLOOKUP($A13,datos!$A$4:$AD$52,3)","v":"Uruguay"},{"$f":"VLOOKUP($A13,datos!$A$4:$AD$52,4)","v":147},{"$f":"VLOOKUP($A13,datos!$A$4:$AD$52,5)","v":129},{"$f":"VLOOKUP($A13,datos!$A$4:$AD$52,6)","v":163},{"$f":"VLOOKUP($A13,datos!$A$4:$AD$52,7)","v":146},{"$f":"VLOOKUP($A13,datos!$A$4:$AD$52,8)","v":170},{"$f":"VLOOKUP($A13,datos!$A$4:$AD$52,9)","v":166},{"$f":"VLOOKUP($A13,datos!$A$4:$AD$52,10)","v":165},{"$f":"VLOOKUP($A13,datos!$A$4:$AD$52,11)","v":184},{"$f":"VLOOKUP($A13,datos!$A$4:$AD$52,12)","v":156},{"$f":"VLOOKUP($A13,datos!$A$4:$AD$52,13)","v":123},{"$f":"VLOOKUP($A13,datos!$A$4:$AD$52,14)","v":195},{"$f":"VLOOKUP($A13,datos!$A$4:$AD$52,15)","v":170},1914,12,159.5,"8º",458]
["J10",{"$f":"VLOOKUP($A14,datos!$A$4:$AD$52,2)","v":"FRANCO GARCIA D."},{"$f":"VLOOKUP($A14,datos!$A$4:$AD$52,3)","v":"Uruguay"},{"$f":"VLOOKUP($A14,datos!$A$4:$AD$52,4)","v":149},{"$f":"VLOOKUP($A14,datos!$A$4:$AD$52,5)","v":142},{"$f":"VLOOKUP($A14,datos!$A$4:$AD$52,6)","v":155},{"$f":"VLOOKUP($A14,datos!$A$4:$AD$52,7)","v":114},{"$f":"VLOOKUP($A14,datos!$A$4:$AD$52,8)","v":136},{"$f":"VLOOKUP($A14,datos!$A$4:$AD$52,9)","v":166},{"$f":"VLOOKUP($A14,datos!$A$4:$AD$52,10)","v":201},{"$f":"VLOOKUP($A14,datos!$A$4:$AD$52,11)","v":135},{"$f":"VLOOKUP($A14,datos!$A$4:$AD$52,12)","v":128},{"$f":"VLOOKUP($A14,datos!$A$4:$AD$52,13)","v":170},{"$f":"VLOOKUP($A14,datos!$A$4:$AD$52,14)","v":165},{"$f":"VLOOKUP($A14,datos!$A$4:$AD$52,15)","v":178},1839,12,153.25,"9º",533]
["J07",{"$f":"VLOOKUP($A15,datos!$A$4:$AD$52,2)","v":"EDUARDO MARTINEZ G"},{"$f":"VLOOKUP($A15,datos!$A$4:$AD$52,3)","v":"Chile"},{"$f":"VLOOKUP($A15,datos!$A$4:$AD$52,4)","v":136},{"$f":"VLOOKUP($A15,datos!$A$4:$AD$52,5)","v":146},{"$f":"VLOOKUP($A15,datos!$A$4:$AD$52,6)","v":136},{"$f":"VLOOKUP($A15,datos!$A$4:$AD$52,7)","v":165},{"$f":"VLOOKUP($A15,datos!$A$4:$AD$52,8)","v":137},{"$f":"VLOOKUP($A15,datos!$A$4:$AD$52,9)","v":134},{"$f":"VLOOKUP($A15,datos!$A$4:$AD$52,10)","v":110},{"$f":"VLOOKUP($A15,datos!$A$4:$AD$52,11)","v":115},{"$f":"VLOOKUP($A15,datos!$A$4:$AD$52,12)","v":120},{"$f":"VLOOKUP($A15,datos!$A$4:$AD$52,13)","v":162},{"$f":"VLOOKUP($A15,datos!$A$4:$AD$52,14)","v":132},{"$f":"VLOOKUP($A15,datos!$A$4:$AD$52,15)","v":154},1647,12,137.25,"10º",725]
["J06",{"$f":"VLOOKUP($A16,datos!$A$4:$AD$52,2)","v":"SEBASTIAN VICENCIO R"},{"$f":"VLOOKUP($A16,datos!$A$4:$AD$52,3)","v":"Chile"},{"$f":"VLOOKUP($A16,datos!$A$4:$AD$52,4)","v":121},{"$f":"VLOOKUP($A16,datos!$A$4:$AD$52,5)","v":94},{"$f":"VLOOKUP($A16,datos!$A$4:$AD$52,6)","v":111},{"$f":"VLOOKUP($A16,datos!$A$4:$AD$52,7)","v":125},{"$f":"VLOOKUP($A16,datos!$A$4:$AD$52,8)","v":119},{"$f":"VLOOKUP($A16,datos!$A$4:$AD$52,9)","v":132},{"$f":"VLOOKUP($A16,datos!$A$4:$AD$52,10)","v":152},{"$f":"VLOOKUP($A16,datos!$A$4:$AD$52,11)","v":131},{"$f":"VLOOKUP($A16,datos!$A$4:$AD$52,12)","v":148},{"$f":"VLOOKUP($A16,datos!$A$4:$AD$52,13)","v":145},{"$f":"VLOOKUP($A16,datos!$A$4:$AD$52,14)","v":130},{"$f":"VLOOKUP($A16,datos!$A$4:$AD$52,15)","v":130},1538,12,128.16666666666666,"11º",834]

{"sheet":"PAR","index":2,"n_rows":31,"n_cols":22,"rows_kept":31,"cut":false,"hidden":false,"merged":[[16,19,17,19],[21,19,22,19],[26,19,27,19],[1,0,1,19],[2,0,2,19],[11,19,12,19],[3,1,3,19],[6,19,7,19]]}
[]
["                        CAMPEONATO SUDAMERICANO JUVENIL 2014"]
["                  DOBLES  SUB 16"]
[]
["Cod","Nombre del Jugador","FEDERACION","L1","L2","L3","L4","L5","L6","L7","L8","L9","L10","L11","L12","Serie",null,{"$f":"S8","v":419.58333333333331},"Prom","dif"]
["J04",{"$f":"VLOOKUP($A6,datos!$A$4:$AD$52,2)","v":"SEBASTIAN SALAZAR"},{"$f":"VLOOKUP($A6,datos!$A$4:$AD$52,3)","v":"Colombia"},{"$f":"VLOOKUP($A6,datos!$A$4:$AD$52,16)","v":256},{"$f":"VLOOKUP($A6,datos!$A$4:$AD$52,17)","v":278},{"$f":"VLOOKUP($A6,datos!$A$4:$AD$52,18)","v":204},{"$f":"VLOOKUP($A6,datos!$A$4:$AD$52,19)","v":194},{"$f":"VLOOKUP($A6,datos!$A$4:$AD$52,20)","v":238},{"$f":"VLOOKUP($A6,datos!$A$4:$AD$52,21)","v":178},{"$f":"VLOOKUP($A6,datos!$A$4:$AD$52,22)","v":218},{"$f":"VLOOKUP($A6,datos!$A$4:$AD$52,23)","v":168},{"$f":"VLOOKUP($A6,datos!$A$4:$AD$52,24)","v":201},{"$f":"VLOOKUP($A6,datos!$A$4:$AD$52,25)","v":190},{"$f":"VLOOKUP($A6,datos!$A$4:$AD$52,26)","v":158},{"$f":"VLOOKUP($A6,datos!$A$4:$AD$52,27)","v":218},{"$f":"SUM(D6:O6)","v":2501},{"$f":"(COUNTIF(D6:I6,\">0\"))","v":6},{"$f":"S8","v":419.58333333333331},{"$f":"P6/Q6","v":416.83333333333331},{"$f":"$P$8-P8","v":0}]
["J05",{"$f":"VLOOKUP($A7,datos!$A$4:$AD$52,2)","v":"MAURICIO CABRERA"},{"$f":"VLOOKUP($A7,datos!$A$4:$AD$52,3)","v":"Colombia"},{"$f":"VLOOKUP($A7,datos!$A$4:$AD$52,16)","v":189},{"$f":"VLOOKUP($A7,datos!$A$4:$AD$52,17)","v":227},{"$f":"VLOOKUP($A7,datos!$A$4:$AD$52,18)","v":235},{"$f":"VLOOKUP($A7,datos!$A$4:$AD$52,19)","v":187},{"$f":"VLOOKUP($A7,datos!$A$4:$AD$52,20)","v":222},{"$f":"VLOOKUP($A7,datos!$A$4:$AD$52,21)","v":213},{"$f":"VLOOKUP($A7,datos!$A$4:$AD$52,22)","v":232},{"$f":"VLOOKUP($A7,datos!$A$4:$AD$52,23)","v":181},{"$f":"VLOOKUP($A7,datos!$A$4:$AD$52,24)","v":216},{"$f":"VLOOKUP($A7,datos!$A$4:$AD$52,25)","v":224},{"$f":"VLOOKUP($A7,datos!$A$4:$AD$52,26)","v":233},{"$f":"VLOOKUP($A7,datos!$A$4:$AD$52,27)","v":175},{"$f":"SUM(D7:O7)","v":2534},{"$f":"(COUNTIF(D7:I7,\">0\"))","v":6},{"$f":"S8","v":419.58333333333331},{"$f":"P7/Q7","v":422.33333333333331},"1°"]
[null,null,null,{"$f":"SUM(D6:D7)","v":445},505,439,381,460,391,450,349,417,414,391,393,5035,{"$f":"(COUNTIF(D8:I8,\">0\"))*2","v":12},{"$f":"S8","v":419.58333333333331},{"$f":"P8/Q8","v":419.58333333333331},null,null,{"$f":"MAX(D8:I8)","v":505}]
[null,null,null,null,null,null,null,null,null,null,null,null,null,null,null,null,null,{"$f":"S8","v":419.58333333333331}]
["Cod","Nombre del Jugador","FEDERACION","L1","L2","L3","L4","L5","L6","L7","L8","L9","L10","L11","L12","Serie",null,{"$f":"S13","v":404.16666666666669},"Prom","dif"]
["J08",{"$f":"VLOOKUP($A11,datos!$A$4:$AD$52,2)","v":"ALEJANDRO ISHIKAWA"},{"$f":"VLOOKUP($A11,datos!$A$4:$AD$52,3)","v":"Perú"},{"$f":"VLOOKUP($A11,datos!$A$4:$AD$52,16)","v":233},{"$f":"VLOOKUP($A11,datos!$A$4:$AD$52,17)","v":204},{"$f":"VLOOKUP($A11,datos!$A$4:$AD$52,18)","v":222},{"$f":"VLOOKUP($A11,datos!$A$4:$AD$52,19)","v":211},{"$f":"VLOOKUP($A11,datos!$A$4:$AD$52,20)","v":180},{"$f":"VLOOKUP($A11,datos!$A$4:$AD$52,21)","v":187},{"$f":"VLOOKUP($A11,datos!$A$4:$AD$52,22)","v":144},{"$f":"VLOOKUP($A11,datos!$A$4:$AD$52,23)","v":258},{"$f":"VLOOKUP($A11,datos!$A$4:$AD$52,24)","v":178},{"$f":"VLOOKUP($A11,datos!$A$4:$AD$52,25)","v":162},{"$f":"VLOOKUP($A11,datos!$A$4:$AD$52,26)","v":290},{"$f":"VLOOKUP($A11,datos!$A$4:$AD$52,27)","v":161},{"$f":"SUM(D11:O11)","v":2430},{"$f":"(COUNTIF(D11:I11,\">0\"))","v":6},{"$f":"S13","v":404.16666666666669},{"$f":"P11/Q11","v":405},{"$f":"$P$8-P13","v":185}]
["J09",{"$f":"VLOOKUP($A12,datos!$A$4:$AD$52,2)","v":"SEBASTIAN YUZURIHA"},{"$f":"VLOOKUP($A12,datos!$A$4:$AD$52,3)","v":"Perú"},{"$f":"VLOOKUP($A12,datos!$A$4:$AD$52,16)","v":206},{"$f":"VLOOKUP($A12,datos!$A$4:$AD$52,17)","v":188},{"$f":"VLOOKUP($A12,datos!$A$4:$AD$52,18)","v":171},{"$f":"VLOOKUP($A12,datos!$A$4:$AD$52,19)","v":211},{"$f":"VLOOKUP($A12,datos!$A$4:$AD$52,20)","v":219},{"$f":"VLOOKUP($A12,datos!$A$4:$AD$52,21)","v":199},{"$f":"VLOOKUP($A12,datos!$A$4:$AD$52,22)","v":227},{"$f":"VLOOKUP($A12,datos!$A$4:$AD$52,23)","v":152},{"$f":"VLOOKUP($A12,datos!$A$4:$AD$52,24)","v":169},{"$f":"VLOOKUP($A12,datos!$A$4:$AD$52,25)","v":213},{"$f":"VLOOKUP($A12,datos!$A$4:$AD$52,26)","v":223},{"$f":"VLOOKUP($A12,datos!$A$4:$AD$52,27)","v":242},{"$f":"SUM(D12:O12)","v":2420},{"$f":"(COUNTIF(D12:I12,\">0\"))","v":6},{"$f":"S13","v":404.16666666666669},{"$f":"P12/Q12","v":403.33333333333331},"2°"]
[null,null,null,{"$f":"SUM(D11:D12)","v":439},392,393,422,399,386,371,410,347,375,513,403,4850,{"$f":"(COUNTIF(D13:I13,\">0\"))*2","v":12},{"$f":"S13","v":404.16666666666669},{"$f":"P13/Q13","v":404.16666666666669},null,null,{"$f":"MAX(D13:I13)","v":439}]
[null,null,null,null,null,null,null,null,null,null,null,null,null,null,null,null,null,{"$f":"S13","v":404.16666666666669}]
["Cod","Nombre del Jugador","FEDERACION","L1","L2","L3","L4","L5","L6","L7","L8","L9","L10","L11","L12","Serie",null,{"$f":"S18","v":359},"Prom","dif"]
["J02",{"$f":"VLOOKUP($A16,datos!$A$4:$AD$52,2)","v":"JAIR KELLY"},{"$f":"VLOOKUP($A16,datos!$A$4:$AD$52,3)","v":"Aruba"},{"$f":"VLOOKUP($A16,datos!$A$4:$AD$52,16)","v":121},{"$f":"VLOOKUP($A16,datos!$A$4:$AD$52,17)","v":134},{"$f":"VLOOKUP($A16,datos!$A$4:$AD$52,18)","v":158},{"$f":"VLOOKUP($A16,datos!$A$4:$AD$52,19)","v":237},{"$f":"VLOOKUP($A16,datos!$A$4:$AD$52,20)","v":199},{"$f":"VLOOKUP($A16,datos!$A$4:$AD$52,21)","v":200},{"$f":"VLOOKUP($A16,datos!$A$4:$AD$52,22)","v":179},{"$f":"VLOOKUP($A16,datos!$A$4:$AD$52,23)","v":216},{"$f":"VLOOKUP($A16,datos!$A$4:$AD$52,24)","v":169},{"$f":"VLOOKUP($A16,datos!$A$4:$AD$52,25)","v":192},{"$f":"VLOOKUP($A16,datos!$A$4:$AD$52,26)","v":187},{"$f":"VLOOKUP($A16,datos!$A$4:$AD$52,27)","v":227},{"$f":"SUM(D16:O16)","v":2219},{"$f":"(COUNTIF(D16:I16,\">0\"))","v":6},{"$f":"S18","v":359},{"$f":"P16/Q16","v":369.83333333333331},{"$f":"$P$8-P18","v":727}]
["J03",{"$f":"VLOOKUP($A17,datos!$A$4:$AD$52,2)","v":"RENALD THIEL"},{"$f":"VLOOKUP($A17,datos!$A$4:$AD$52,3)","v":"Aruba"},{"$f":"VLOOKUP($A17,datos!$A$4:$AD$52,16)","v":170},{"$f":"VLOOKUP($A17,datos!$A$4:$AD$52,17)","v":150},{"$f":"VLOOKUP($A17,datos!$A$4:$AD$52,18)","v":192},{"$f":"VLOOKUP($A17,datos!$A$4:$AD$52,19)","v":201},{"$f":"VLOOKUP($A17,datos!$A$4:$AD$52,20)","v":229},{"$f":"VLOOKUP($A17,datos!$A$4:$AD$52,21)","v":157},{"$f":"VLOOKUP($A17,datos!$A$4:$AD$52,22)","v":108},{"$f":"VLOOKUP($A17,datos!$A$4:$AD$52,23)","v":158},{"$f":"VLOOKUP($A17,datos!$A$4:$AD$52,24)","v":175},{"$f":"VLOOKUP($A17,datos!$A$4:$AD$52,25)","v":206},{"$f":"VLOOKUP($A17,datos!$A$4:$AD$52,26)","v":200},{"$f":"VLOOKUP($A17,datos!$A$4:$AD$52,27)","v":143},{"$f":"SUM(D17:O17)","v":2089},{"$f":"(COUNTIF(D17:I17,\">0\"))","v":6},{"$f":"S18","v":359},{"$f":"P17/Q17","v":348.16666666666669},"3°"]
[null,null,null,{"$f":"SUM(D16:D17)","v":291},284,350,438,428,357,287,374,344,398,387,370,4308,{"$f":"(COUNTIF(D18:I18,\">0\"))*2","v":12},{"$f":"S18","v":359},{"$f":"P18/Q18","v":359},null,null,{"$f":"MAX(D23:I23)","v":457}]
[null,null,null,null,null,null,null,null,null,null,null,null,null,null,null,null,null,{"$f":"S18","v":359}]
["Cod","Nombre del Jugador","FEDERACION","L1","L2","L3","L4","L5","L6","L7","L8","L9","L10","L11","L12","Serie",null,{"$f":"S23","v":336.58333333333331},"Prom","dif"]
["J10",{"$f":"VLOOKUP($A21,datos!$A$4:$AD$52,2)","v":"FRANCO GARCIA D."},{"$f":"VLOOKUP($A21,datos!$A$4:$AD$52,3)","v":"Uruguay"},{"$f":"VLOOKUP($A21,datos!$A$4:$AD$52,16)","v":221},{"$f":"VLOOKUP($A21,datos!$A$4:$AD$52,17)","v":167},{"$f":"VLOOKUP($A21,datos!$A$4:$AD$52,18)","v":199},{"$f":"VLOOKUP($A21,datos!$A$4:$AD$52,19)","v":190},{"$f":"VLOOKUP($A21,datos!$A$4:$AD$52,20)","v":146},{"$f":"VLOOKUP($A21,datos!$A$4:$AD$52,21)","v":136},{"$f":"VLOOKUP($A21,datos!$A$4:$AD$52,22)","v":175},{"$f":"VLOOKUP($A21,datos!$A$4:$AD$52,23)","v":144},{"$f":"VLOOKUP($A21,datos!$A$4:$AD$52,24)","v":131},{"$f":"VLOOKUP($A21,datos!$A$4:$AD$52,25)","v":166},{"$f":"VLOOKUP($A21,datos!$A$4:$AD$52,26)","v":150},{"$f":"VLOOKUP($A21,datos!$A$4:$AD$52,27)","v":188},{"$f":"SUM(D21:O21)","v":2013},{"$f":"(COUNTIF(D21:I21,\">0\"))","v":6},{"$f":"S23","v":336.58333333333331},{"$f":"P21/Q21","v":335.5},{"$f":"$P$8-P23","v":996}]
["J11",{"$f":"VLOOKUP($A22,datos!$A$4:$AD$52,2)","v":"JOAQUIN MANRIQUE D."},{"$f":"VLOOKUP($A22,datos!$A$4:$AD$52,3)","v":"Uruguay"},{"$f":"VLOOKUP($A22,datos!$A$4:$AD$52,16)","v":236},{"$f":"VLOOKUP($A22,datos!$A$4:$AD$52,17)","v":158},{"$f":"VLOOKUP($A22,datos!$A$4:$AD$52,18)","v":165},{"$f":"VLOOKUP($A22,datos!$A$4:$AD$52,19)","v":140},{"$f":"VLOOKUP($A22,datos!$A$4:$AD$52,20)","v":183},{"$f":"VLOOKUP($A22,datos!$A$4:$AD$52,21)","v":169},{"$f":"VLOOKUP($A22,datos!$A$4:$AD$52,22)","v":165},{"$f":"VLOOKUP($A22,datos!$A$4:$AD$52,23)","v":183},{"$f":"VLOOKUP($A22,datos!$A$4:$AD$52,24)","v":184},{"$f":"VLOOKUP($A22,datos!$A$4:$AD$52,25)","v":179},{"$f":"VLOOKUP($A22,datos!$A$4:$AD$52,26)","v":126},{"$f":"VLOOKUP($A22,datos!$A$4:$AD$52,27)","v":138},{"$f":"SUM(D22:O22)","v":2026},{"$f":"(COUNTIF(D22:I22,\">0\"))","v":6},{"$f":"S23","v":336.58333333333331},{"$f":"P22/Q22","v":337.66666666666669},"4°"]
[null,null,null,{"$f":"SUM(D21:D22)","v":457},325,364,330,329,305,340,327,315,345,276,326,4039,{"$f":"(COUNTIF(D23:I23,\">0\"))*2","v":12},{"$f":"S23","v":336.58333333333331},{"$f":"P23/Q23","v":336.58333333333331},null,null,{"$f":"MAX(D28:I28)","v":324}]
[null,null,null,null,null,null,null,null,null,null,null,null,null,null,null,null,null,{"$f":"S23","v":336.58333333333331}]
["Cod","Nombre del Jugador","FEDERACION","L1","L2","L3","L4","L5","L6","L7","L8","L9","L10","L11","L12","Serie",null,{"$f":"S28","v":271.91666666666669},"Prom","dif"]
["J06",{"$f":"VLOOKUP($A26,datos!$A$4:$AD$52,2)","v":"SEBASTIAN VICENCIO R"},{"$f":"VLOOKUP($A26,datos!$A$4:$AD$52,3)","v":"Chile"},{"$f":"VLOOKUP($A26,datos!$A$4:$AD$52,16)","v":100},{"$f":"VLOOKUP($A26,datos!$A$4:$AD$52,17)","v":103},{"$f":"VLOOKUP($A26,datos!$A$4:$AD$52,18)","v":89},{"$f":"VLOOKUP($A26,datos!$A$4:$AD$52,19)","v":127},{"$f":"VLOOKUP($A26,datos!$A$4:$AD$52,20)","v":163},{"$f":"VLOOKUP($A26,datos!$A$4:$AD$52,21)","v":169},{"$f":"VLOOKUP($A26,datos!$A$4:$AD$52,22)","v":122},{"$f":"VLOOKUP($A26,datos!$A$4:$AD$52,23)","v":97},{"$f":"VLOOKUP($A26,datos!$A$4:$AD$52,24)","v":142},{"$f":"VLOOKUP($A26,datos!$A$4:$AD$52,25)","v":147},{"$f":"VLOOKUP($A26,datos!$A$4:$AD$52,26)","v":132},{"$f":"VLOOKUP($A26,datos!$A$4:$AD$52,27)","v":100},{"$f":"SUM(D26:O26)","v":1491},{"$f":"(COUNTIF(D26:I26,\">0\"))","v":6},{"$f":"S28","v":271.91666666666669},{"$f":"P26/Q26","v":248.5},{"$f":"$P$8-P28","v":1772}]
["J07",{"$f":"VLOOKUP($A27,datos!$A$4:$AD$52,2)","v":"EDUARDO MARTINEZ G"},{"$f":"VLOOKUP($A27,datos!$A$4:$AD$52,3)","v":"Chile"},{"$f":"VLOOKUP($A27,datos!$A$4:$AD$52,16)","v":177},{"$f":"VLOOKUP($A27,datos!$A$4:$AD$52,17)","v":158},{"$f":"VLOOKUP($A27,datos!$A$4:$AD$52,18)","v":122},{"$f":"VLOOKUP($A27,datos!$A$4:$AD$52,19)","v":134},{"$f":"VLOOKUP($A27,datos!$A$4:$AD$52,20)","v":127},{"$f":"VLOOKUP($A27,datos!$A$4:$AD$52,21)","v":155},{"$f":"VLOOKUP($A27,datos!$A$4:$AD$52,22)","v":164},{"$f":"VLOOKUP($A27,datos!$A$4:$AD$52,23)","v":130},{"$f":"VLOOKUP($A27,datos!$A$4:$AD$52,24)","v":131},{"$f":"VLOOKUP($A27,datos!$A$4:$AD$52,25)","v":125},{"$f":"VLOOKUP($A27,datos!$A$4:$AD$52,26)","v":165},{"$f":"VLOOKUP($A27,datos!$A$4:$AD$52,27)","v":184},{"$f":"SUM(D27:O27)","v":1772},{"$f":"(COUNTIF(D27:I27,\">0\"))","v":6},{"$f":"S28","v":271.91666666666669},{"$f":"P27/Q27","v":295.33333333333331},"5°"]
[null,null,null,{"$f":"SUM(D26:D27)","v":277},261,211,261,290,324,286,227,273,272,297,284,3263,{"$f":"(COUNTIF(D28:I28,\">0\"))*2","v":12},{"$f":"S28","v":271.91666666666669},{"$f":"P28/Q28","v":271.91666666666669},null,null,{"$f":"MAX(#REF!)","v":{"$error":"#REF!"}}]
[null,null,null,null,null,null,null,null,null,null,null,null,null,null,null,null,null,{"$f":"S28","v":271.91666666666669}]
["Cod","Nombre del Jugador","FEDERACION","L1","L2","L3","L4","L5","L6","L7","L8","L9","L10","L11","L12","Serie",null,{"$f":"#REF!","v":{"$error":"#REF!"}},"Prom"]
["J01",{"$f":"VLOOKUP($A31,datos!$A$4:$AD$52,2)","v":"JUAN IGNACIO ALI"},{"$f":"VLOOKUP($A31,datos!$A$4:$AD$52,3)","v":"Argentina"},{"$f":"VLOOKUP($A31,datos!$A$4:$AD$52,16)","v":162},{"$f":"VLOOKUP($A31,datos!$A$4:$AD$52,17)","v":182},{"$f":"VLOOKUP($A31,datos!$A$4:$AD$52,18)","v":168},{"$f":"VLOOKUP($A31,datos!$A$4:$AD$52,19)","v":167},{"$f":"VLOOKUP($A31,datos!$A$4:$AD$52,20)","v":201},{"$f":"VLOOKUP($A31,datos!$A$4:$AD$52,21)","v":155},{"$f":"VLOOKUP($A31,datos!$A$4:$AD$52,22)","v":175},{"$f":"VLOOKUP($A31,datos!$A$4:$AD$52,23)","v":163},{"$f":"VLOOKUP($A31,datos!$A$4:$AD$52,24)","v":167},{"$f":"VLOOKUP($A31,datos!$A$4:$AD$52,25)","v":166},{"$f":"VLOOKUP($A31,datos!$A$4:$AD$52,26)","v":173},{"$f":"VLOOKUP($A31,datos!$A$4:$AD$52,27)","v":216},{"$f":"SUM(D31:O31)","v":2095},{"$f":"(COUNTIF(D31:I31,\">0\"))","v":6},{"$f":"#REF!","v":{"$error":"#REF!"}},{"$f":"P31/Q31","v":349.16666666666669}]

{"sheet":"T EVENTO","index":3,"n_rows":17,"n_cols":34,"rows_kept":17,"cut":false,"hidden":false,"merged":[[4,3,4,8],[4,9,4,15],[4,22,4,28],[4,16,4,21],[1,0,1,32],[2,0,2,32],[3,0,3,32]]}
[]
["CAMPEONATO SUDAMERICANO JUVENIL 2014"]
["TODO EVENTO INDIVIDUAL"]
["SANTIAGO DE CHILE - DEL 12 AL 18 DE ABRIL DE 2014"]
[null,null,null,"IND. S1",null,null,null,null,null,"INDIVIDUAL 12L",null,null,null,null,null,null,"DOBLES S1",null,null,null,null,null,"DOBLES 12L"]
["Cod","Nombre del Jugador","FEDERACION","L1","L2","L3","L4","L5","L6","L7","L8","L9","L10","L11","L12","Serie","L13","L14","L15","L16","L17","L18","L19","L20","L21","L22","L23","L24","Serie","L","Total","Prom","Pos.","dif"]
["J05",{"$f":"VLOOKUP($A7,datos!$A$4:$AD$52,2)","v":"MAURICIO CABRERA"},{"$f":"VLOOKUP($A7,datos!$A$4:$AD$52,3)","v":"Colombia"},{"$f":"VLOOKUP($A7,datos!$A$4:$AD$52,4)","v":257},{"$f":"VLOOKUP($A7,datos!$A$4:$AD$52,5)","v":212},{"$f":"VLOOKUP($A7,datos!$A$4:$AD$52,6)","v":213},{"$f":"VLOOKUP($A7,datos!$A$4:$AD$52,7)","v":188},{"$f":"VLOOKUP($A7,datos!$A$4:$AD$52,8)","v":191},{"$f":"VLOOKUP($A7,datos!$A$4:$AD$52,9)","v":161},{"$f":"VLOOKUP($A7,datos!$A$4:$AD$52,10)","v":191},{"$f":"VLOOKUP($A7,datos!$A$4:$AD$52,11)","v":190},{"$f":"VLOOKUP($A7,datos!$A$4:$AD$52,12)","v":171},{"$f":"VLOOKUP($A7,datos!$A$4:$AD$52,13)","v":190},{"$f":"VLOOKUP($A7,datos!$A$4:$AD$52,14)","v":228},{"$f":"VLOOKUP($A7,datos!$A$4:$AD$52,15)","v":180},{"$f":"SUM(D7:O7)","v":2372},{"$f":"VLOOKUP($A7,datos!$A$4:$AD$52,16)","v":189},{"$f":"VLOOKUP($A7,datos!$A$4:$AD$52,17)","v":227},{"$f":"VLOOKUP($A7,datos!$A$4:$AD$52,18)","v":235},{"$f":"VLOOKUP($A7,datos!$A$4:$AD$52,19)","v":187},{"$f":"VLOOKUP($A7,datos!$A$4:$AD$52,20)","v":222},{"$f":"VLOOKUP($A7,datos!$A$4:$AD$52,21)","v":213},{"$f":"VLOOKUP($A7,datos!$A$4:$AD$52,22)","v":232},{"$f":"VLOOKUP($A7,datos!$A$4:$AD$52,23)","v":181},{"$f":"VLOOKUP($A7,datos!$A$4:$AD$52,24)","v":216},{"$f":"VLOOKUP($A7,datos!$A$4:$AD$52,25)","v":224},{"$f":"VLOOKUP($A7,datos!$A$4:$AD$52,26)","v":233},{"$f":"VLOOKUP($A7,datos!$A$4:$AD$52,27)","v":175},{"$f":"SUM(Q7:AB7)","v":2534},{"$f":"VLOOKUP($A7,datos!$A$4:$AD$52,28)","v":24},{"$f":"VLOOKUP($A7,datos!$A$4:$AD$52,29)","v":4906},{"$f":"AE7/AD7","v":204.41666666666666},"1º",{"$f":"MAX($AE$7:$AE$17)-AE7","v":0}]
["J04",{"$f":"VLOOKUP($A8,datos!$A$4:$AD$52,2)","v":"SEBASTIAN SALAZAR"},{"$f":"VLOOKUP($A8,datos!$A$4:$AD$52,3)","v":"Colombia"},{"$f":"VLOOKUP($A8,datos!$A$4:$AD$52,4)","v":213},{"$f":"VLOOKUP($A8,datos!$A$4:$AD$52,5)","v":222},{"$f":"VLOOKUP($A8,datos!$A$4:$AD$52,6)","v":159},{"$f":"VLOOKUP($A8,datos!$A$4:$AD$52,7)","v":211},{"$f":"VLOOKUP($A8,datos!$A$4:$AD$52,8)","v":233},{"$f":"VLOOKUP($A8,datos!$A$4:$AD$52,9)","v":145},{"$f":"VLOOKUP($A8,datos!$A$4:$AD$52,10)","v":194},{"$f":"VLOOKUP($A8,datos!$A$4:$AD$52,11)","v":170},{"$f":"VLOOKUP($A8,datos!$A$4:$AD$52,12)","v":203},{"$f":"VLOOKUP($A8,datos!$A$4:$AD$52,13)","v":211},{"$f":"VLOOKUP($A8,datos!$A$4:$AD$52,14)","v":158},{"$f":"VLOOKUP($A8,datos!$A$4:$AD$52,15)","v":180},2299,{"$f":"VLOOKUP($A8,datos!$A$4:$AD$52,16)","v":256},{"$f":"VLOOKUP($A8,datos!$A$4:$AD$52,17)","v":278},{"$f":"VLOOKUP($A8,datos!$A$4:$AD$52,18)","v":204},{"$f":"VLOOKUP($A8,datos!$A$4:$AD$52,19)","v":194},{"$f":"VLOOKUP($A8,datos!$A$4:$AD$52,20)","v":238},{"$f":"VLOOKUP($A8,datos!$A$4:$AD$52,21)","v":178},{"$f":"VLOOKUP($A8,datos!$A$4:$AD$52,22)","v":218},{"$f":"VLOOKUP($A8,datos!$A$4:$AD$52,23)","v":168},{"$f":"VLOOKUP($A8,datos!$A$4:$AD$52,24)","v":201},{"$f":"VLOOKUP($A8,datos!$A$4:$AD$52,25)","v":190},{"$f":"VLOOKUP($A8,datos!$A$4:$AD$52,26)","v":158},{"$f":"VLOOKUP($A8,datos!$A$4:$AD$52,27)","v":218},2501,{"$f":"VLOOKUP($A8,datos!$A$4:$AD$52,28)","v":24},{"$f":"VLOOKUP($A8,datos!$A$4:$AD$52,29)","v":4800},200,"2º",106]
["J09",{"$f":"VLOOKUP($A9,datos!$A$4:$AD$52,2)","v":"SEBASTIAN YUZURIHA"},{"$f":"VLOOKUP($A9,datos!$A$4:$AD$52,3)","v":"Perú"},{"$f":"VLOOKUP($A9,datos!$A$4:$AD$52,4)","v":155},{"$f":"VLOOKUP($A9,datos!$A$4:$AD$52,5)","v":168},{"$f":"VLOOKUP($A9,datos!$A$4:$AD$52,6)","v":201},{"$f":"VLOOKUP($A9,datos!$A$4:$AD$52,7)","v":264},{"$f":"VLOOKUP($A9,datos!$A$4:$AD$52,8)","v":277},{"$f":"VLOOKUP($A9,datos!$A$4:$AD$52,9)","v":205},{"$f":"VLOOKUP($A9,datos!$A$4:$AD$52,10)","v":189},{"$f":"VLOOKUP($A9,datos!$A$4:$AD$52,11)","v":200},{"$f":"VLOOKUP($A9,datos!$A$4:$AD$52,12)","v":153},{"$f":"VLOOKUP($A9,datos!$A$4:$AD$52,13)","v":182},{"$f":"VLOOKUP($A9,datos!$A$4:$AD$52,14)","v":168},{"$f":"VLOOKUP($A9,datos!$A$4:$AD$52,15)","v":184},2346,{"$f":"VLOOKUP($A9,datos!$A$4:$AD$52,16)","v":206},{"$f":"VLOOKUP($A9,datos!$A$4:$AD$52,17)","v":188},{"$f":"VLOOKUP($A9,datos!$A$4:$AD$52,18)","v":171},{"$f":"VLOOKUP($A9,datos!$A$4:$AD$52,19)","v":211},{"$f":"VLOOKUP($A9,datos!$A$4:$AD$52,20)","v":219},{"$f":"VLOOKUP($A9,datos!$A$4:$AD$52,21)","v":199},{"$f":"VLOOKUP($A9,datos!$A$4:$AD$52,22)","v":227},{"$f":"VLOOKUP($A9,datos!$A$4:$AD$52,23)","v":152},{"$f":"VLOOKUP($A9,datos!$A$4:$AD$52,24)","v":169},{"$f":"VLOOKUP($A9,datos!$A$4:$AD$52,25)","v":213},{"$f":"VLOOKUP($A9,datos!$A$4:$AD$52,26)","v":223},{"$f":"VLOOKUP($A9,datos!$A$4:$AD$52,27)","v":242},2420,{"$f":"VLOOKUP($A9,datos!$A$4:$AD$52,28)","v":24},{"$f":"VLOOKUP($A9,datos!$A$4:$AD$52,29)","v":4766},198.58333333333334,"3º",140]
["J08",{"$f":"VLOOKUP($A10,datos!$A$4:$AD$52,2)","v":"ALEJANDRO ISHIKAWA"},{"$f":"VLOOKUP($A10,datos!$A$4:$AD$52,3)","v":"Perú"},{"$f":"VLOOKUP($A10,datos!$A$4:$AD$52,4)","v":166},{"$f":"VLOOKUP($A10,datos!$A$4:$AD$52,5)","v":179},{"$f":"VLOOKUP($A10,datos!$A$4:$AD$52,6)","v":214},{"$f":"VLOOKUP($A10,datos!$A$4:$AD$52,7)","v":188},{"$f":"VLOOKUP($A10,datos!$A$4:$AD$52,8)","v":228},{"$f":"VLOOKUP($A10,datos!$A$4:$AD$52,9)","v":195},{"$f":"VLOOKUP($A10,datos!$A$4:$AD$52,10)","v":141},{"$f":"VLOOKUP($A10,datos!$A$4:$AD$52,11)","v":237},{"$f":"VLOOKUP($A10,datos!$A$4:$AD$52,12)","v":165},{"$f":"VLOOKUP($A10,datos!$A$4:$AD$52,13)","v":179},{"$f":"VLOOKUP($A10,datos!$A$4:$AD$52,14)","v":160},{"$f":"VLOOKUP($A10,datos!$A$4:$AD$52,15)","v":170},2222,{"$f":"VLOOKUP($A10,datos!$A$4:$AD$52,16)","v":233},{"$f":"VLOOKUP($A10,datos!$A$4:$AD$52,17)","v":204},{"$f":"VLOOKUP($A10,datos!$A$4:$AD$52,18)","v":222},{"$f":"VLOOKUP($A10,datos!$A$4:$AD$52,19)","v":211},{"$f":"VLOOKUP($A10,datos!$A$4:$AD$52,20)","v":180},{"$f":"VLOOKUP($A10,datos!$A$4:$AD$52,21)","v":187},{"$f":"VLOOKUP($A10,datos!$A$4:$AD$52,22)","v":144},{"$f":"VLOOKUP($A10,datos!$A$4:$AD$52,23)","v":258},{"$f":"VLOOKUP($A10,datos!$A$4:$AD$52,24)","v":178},{"$f":"VLOOKUP($A10,datos!$A$4:$AD$52,25)","v":162},{"$f":"VLOOKUP($A10,datos!$A$4:$AD$52,26)","v":290},{"$f":"VLOOKUP($A10,datos!$A$4:$AD$52,27)","v":161},2430,{"$f":"VLOOKUP($A10,datos!$A$4:$AD$52,28)","v":24},{"$f":"VLOOKUP($A10,datos!$A$4:$AD$52,29)","v":4652},193.83333333333334,"4º",254]
["J03",{"$f":"VLOOKUP($A11,datos!$A$4:$AD$52,2)","v":"RENALD THIEL"},{"$f":"VLOOKUP($A11,datos!$A$4:$AD$52,3)","v":"Aruba"},{"$f":"VLOOKUP($A11,datos!$A$4:$AD$52,4)","v":213},{"$f":"VLOOKUP($A11,datos!$A$4:$AD$52,5)","v":160},{"$f":"VLOOKUP($A11,datos!$A$4:$AD$52,6)","v":173},{"$f":"VLOOKUP($A11,datos!$A$4:$AD$52,7)","v":214},{"$f":"VLOOKUP($A11,datos!$A$4:$AD$52,8)","v":194},{"$f":"VLOOKUP($A11,datos!$A$4:$AD$52,9)","v":202},{"$f":"VLOOKUP($A11,datos!$A$4:$AD$52,10)","v":204},{"$f":"VLOOKUP($A11,datos!$A$4:$AD$52,11)","v":191},{"$f":"VLOOKUP($A11,datos!$A$4:$AD$52,12)","v":221},{"$f":"VLOOKUP($A11,datos!$A$4:$AD$52,13)","v":187},{"$f":"VLOOKUP($A11,datos!$A$4:$AD$52,14)","v":188},{"$f":"VLOOKUP($A11,datos!$A$4:$AD$52,15)","v":170},2317,{"$f":"VLOOKUP($A11,datos!$A$4:$AD$52,16)","v":170},{"$f":"VLOOKUP($A11,datos!$A$4:$AD$52,17)","v":150},{"$f":"VLOOKUP($A11,datos!$A$4:$AD$52,18)","v":192},{"$f":"VLOOKUP($A11,datos!$A$4:$AD$52,19)","v":201},{"$f":"VLOOKUP($A11,datos!$A$4:$AD$52,20)","v":229},{"$f":"VLOOKUP($A11,datos!$A$4:$AD$52,21)","v":157},{"$f":"VLOOKUP($A11,datos!$A$4:$AD$52,22)","v":108},{"$f":"VLOOKUP($A11,datos!$A$4:$AD$52,23)","v":158},{"$f":"VLOOKUP($A11,datos!$A$4:$AD$52,24)","v":175},{"$f":"VLOOKUP($A11,datos!$A$4:$AD$52,25)","v":206},{"$f":"VLOOKUP($A11,datos!$A$4:$AD$52,26)","v":200},{"$f":"VLOOKUP($A11,datos!$A$4:$AD$52,27)","v":143},2089,{"$f":"VLOOKUP($A11,datos!$A$4:$AD$52,28)","v":24},{"$f":"VLOOKUP($A11,datos!$A$4:$AD$52,29)","v":4406},183.58333333333334,"5º",500]
["J02",{"$f":"VLOOKUP($A12,datos!$A$4:$AD$52,2)","v":"JAIR KELLY"},{"$f":"VLOOKUP($A12,datos!$A$4:$AD$52,3)","v":"Aruba"},{"$f":"VLOOKUP($A12,datos!$A$4:$AD$52,4)","v":118},{"$f":"VLOOKUP($A12,datos!$A$4:$AD$52,5)","v":147},{"$f":"VLOOKUP($A12,datos!$A$4:$AD$52,6)","v":188},{"$f":"VLOOKUP($A12,datos!$A$4:$AD$52,7)","v":211},{"$f":"VLOOKUP($A12,datos!$A$4:$AD$52,8)","v":199},{"$f":"VLOOKUP($A12,datos!$A$4:$AD$52,9)","v":146},{"$f":"VLOOKUP($A12,datos!$A$4:$AD$52,10)","v":204},{"$f":"VLOOKUP($A12,datos!$A$4:$AD$52,11)","v":141},{"$f":"VLOOKUP($A12,datos!$A$4:$AD$52,12)","v":124},{"$f":"VLOOKUP($A12,datos!$A$4:$AD$52,13)","v":232},{"$f":"VLOOKUP($A12,datos!$A$4:$AD$52,14)","v":166},{"$f":"VLOOKUP($A12,datos!$A$4:$AD$52,15)","v":162},2038,{"$f":"VLOOKUP($A12,datos!$A$4:$AD$52,16)","v":121},{"$f":"VLOOKUP($A12,datos!$A$4:$AD$52,17)","v":134},{"$f":"VLOOKUP($A12,datos!$A$4:$AD$52,18)","v":158},{"$f":"VLOOKUP($A12,datos!$A$4:$AD$52,19)","v":237},{"$f":"VLOOKUP($A12,datos!$A$4:$AD$52,20)","v":199},{"$f":"VLOOKUP($A12,datos!$A$4:$AD$52,21)","v":200},{"$f":"VLOOKUP($A12,datos!$A$4:$AD$52,22)","v":179},{"$f":"VLOOKUP($A12,datos!$A$4:$AD$52,23)","v":216},{"$f":"VLOOKUP($A12,datos!$A$4:$AD$52,24)","v":169},{"$f":"VLOOKUP($A12,datos!$A$4:$AD$52,25)","v":192},{"$f":"VLOOKUP($A12,datos!$A$4:$AD$52,26)","v":187},{"$f":"VLOOKUP($A12,datos!$A$4:$AD$52,27)","v":227},2219,{"$f":"VLOOKUP($A12,datos!$A$4:$AD$52,28)","v":24},{"$f":"VLOOKUP($A12,datos!$A$4:$AD$52,29)","v":4257},177.375,"6º",649]
["J01",{"$f":"VLOOKUP($A13,datos!$A$4:$AD$52,2)","v":"JUAN IGNACIO ALI"},{"$f":"VLOOKUP($A13,datos!$A$4:$AD$52,3)","v":"Argentina"},{"$f":"VLOOKUP($A13,datos!$A$4:$AD$52,4)","v":171},{"$f":"VLOOKUP($A13,datos!$A$4:$AD$52,5)","v":182},{"$f":"VLOOKUP($A13,datos!$A$4:$AD$52,6)","v":177},{"$f":"VLOOKUP($A13,datos!$A$4:$AD$52,7)","v":157},{"$f":"VLOOKUP($A13,datos!$A$4:$AD$52,8)","v":160},{"$f":"VLOOKUP($A13,datos!$A$4:$AD$52,9)","v":202},{"$f":"VLOOKUP($A13,datos!$A$4:$AD$52,10)","v":179},{"$f":"VLOOKUP($A13,datos!$A$4:$AD$52,11)","v":166},{"$f":"VLOOKUP($A13,datos!$A$4:$AD$52,12)","v":170},{"$f":"VLOOKUP($A13,datos!$A$4:$AD$52,13)","v":180},{"$f":"VLOOKUP($A13,datos!$A$4:$AD$52,14)","v":190},{"$f":"VLOOKUP($A13,datos!$A$4:$AD$52,15)","v":180},2114,{"$f":"VLOOKUP($A13,datos!$A$4:$AD$52,16)","v":162},{"$f":"VLOOKUP($A13,datos!$A$4:$AD$52,17)","v":182},{"$f":"VLOOKUP($A13,datos!$A$4:$AD$52,18)","v":168},{"$f":"VLOOKUP($A13,datos!$A$4:$AD$52,19)","v":167},{"$f":"VLOOKUP($A13,datos!$A$4:$AD$52,20)","v":201},{"$f":"VLOOKUP($A13,datos!$A$4:$AD$52,21)","v":155},{"$f":"VLOOKUP($A13,datos!$A$4:$AD$52,22)","v":175},{"$f":"VLOOKUP($A13,datos!$A$4:$AD$52,23)","v":163},{"$f":"VLOOKUP($A13,datos!$A$4:$AD$52,24)","v":167},{"$f":"VLOOKUP($A13,datos!$A$4:$AD$52,25)","v":166},{"$f":"VLOOKUP($A13,datos!$A$4:$AD$52,26)","v":173},{"$f":"VLOOKUP($A13,datos!$A$4:$AD$52,27)","v":216},2095,{"$f":"VLOOKUP($A13,datos!$A$4:$AD$52,28)","v":24},{"$f":"VLOOKUP($A13,datos!$A$4:$AD$52,29)","v":4209},175.375,"7º",697]
["J11",{"$f":"VLOOKUP($A14,datos!$A$4:$AD$52,2)","v":"JOAQUIN MANRIQUE D."},{"$f":"VLOOKUP($A14,datos!$A$4:$AD$52,3)","v":"Uruguay"},{"$f":"VLOOKUP($A14,datos!$A$4:$AD$52,4)","v":147},{"$f":"VLOOKUP($A14,datos!$A$4:$AD$52,5)","v":129},{"$f":"VLOOKUP($A14,datos!$A$4:$AD$52,6)","v":163},{"$f":"VLOOKUP($A14,datos!$A$4:$AD$52,7)","v":146},{"$f":"VLOOKUP($A14,datos!$A$4:$AD$52,8)","v":170},{"$f":"VLOOKUP($A14,datos!$A$4:$AD$52,9)","v":166},{"$f":"VLOOKUP($A14,datos!$A$4:$AD$52,10)","v":165},{"$f":"VLOOKUP($A14,datos!$A$4:$AD$52,11)","v":184},{"$f":"VLOOKUP($A14,datos!$A$4:$AD$52,12)","v":156},{"$f":"VLOOKUP($A14,datos!$A$4:$AD$52,13)","v":123},{"$f":"VLOOKUP($A14,datos!$A$4:$AD$52,14)","v":195},{"$f":"VLOOKUP($A14,datos!$A$4:$AD$52,15)","v":170},1914,{"$f":"VLOOKUP($A14,datos!$A$4:$AD$52,16)","v":236},{"$f":"VLOOKUP($A14,datos!$A$4:$AD$52,17)","v":158},{"$f":"VLOOKUP($A14,datos!$A$4:$AD$52,18)","v":165},{"$f":"VLOOKUP($A14,datos!$A$4:$AD$52,19)","v":140},{"$f":"VLOOKUP($A14,datos!$A$4:$AD$52,20)","v":183},{"$f":"VLOOKUP($A14,datos!$A$4:$AD$52,21)","v":169},{"$f":"VLOOKUP($A14,datos!$A$4:$AD$52,22)","v":165},{"$f":"VLOOKUP($A14,datos!$A$4:$AD$52,23)","v":183},{"$f":"VLOOKUP($A14,datos!$A$4:$AD$52,24)","v":184},{"$f":"VLOOKUP($A14,datos!$A$4:$AD$52,25)","v":179},{"$f":"VLOOKUP($A14,datos!$A$4:$AD$52,26)","v":126},{"$f":"VLOOKUP($A14,datos!$A$4:$AD$52,27)","v":138},2026,{"$f":"VLOOKUP($A14,datos!$A$4:$AD$52,28)","v":24},{"$f":"VLOOKUP($A14,datos!$A$4:$AD$52,29)","v":3940},164.16666666666666,"8º",966]
["J10",{"$f":"VLOOKUP($A15,datos!$A$4:$AD$52,2)","v":"FRANCO GARCIA D."},{"$f":"VLOOKUP($A15,datos!$A$4:$AD$52,3)","v":"Uruguay"},{"$f":"VLOOKUP($A15,datos!$A$4:$AD$52,4)","v":149},{"$f":"VLOOKUP($A15,datos!$A$4:$AD$52,5)","v":142},{"$f":"VLOOKUP($A15,datos!$A$4:$AD$52,6)","v":155},{"$f":"VLOOKUP($A15,datos!$A$4:$AD$52,7)","v":114},{"$f":"VLOOKUP($A15,datos!$A$4:$AD$52,8)","v":136},{"$f":"VLOOKUP($A15,datos!$A$4:$AD$52,9)","v":166},{"$f":"VLOOKUP($A15,datos!$A$4:$AD$52,10)","v":201},{"$f":"VLOOKUP($A15,datos!$A$4:$AD$52,11)","v":135},{"$f":"VLOOKUP($A15,datos!$A$4:$AD$52,12)","v":128},{"$f":"VLOOKUP($A15,datos!$A$4:$AD$52,13)","v":170},{"$f":"VLOOKUP($A15,datos!$A$4:$AD$52,14)","v":165},{"$f":"VLOOKUP($A15,datos!$A$4:$AD$52,15)","v":178},1839,{"$f":"VLOOKUP($A15,datos!$A$4:$AD$52,16)","v":221},{"$f":"VLOOKUP($A15,datos!$A$4:$AD$52,17)","v":167},{"$f":"VLOOKUP($A15,datos!$A$4:$AD$52,18)","v":199},{"$f":"VLOOKUP($A15,datos!$A$4:$AD$52,19)","v":190},{"$f":"VLOOKUP($A15,datos!$A$4:$AD$52,20)","v":146},{"$f":"VLOOKUP($A15,datos!$A$4:$AD$52,21)","v":136},{"$f":"VLOOKUP($A15,datos!$A$4:$AD$52,22)","v":175},{"$f":"VLOOKUP($A15,datos!$A$4:$AD$52,23)","v":144},{"$f":"VLOOKUP($A15,datos!$A$4:$AD$52,24)","v":131},{"$f":"VLOOKUP($A15,datos!$A$4:$AD$52,25)","v":166},{"$f":"VLOOKUP($A15,datos!$A$4:$AD$52,26)","v":150},{"$f":"VLOOKUP($A15,datos!$A$4:$AD$52,27)","v":188},2013,{"$f":"VLOOKUP($A15,datos!$A$4:$AD$52,28)","v":24},{"$f":"VLOOKUP($A15,datos!$A$4:$AD$52,29)","v":3852},160.5,"9º",1054]
["J07",{"$f":"VLOOKUP($A16,datos!$A$4:$AD$52,2)","v":"EDUARDO MARTINEZ G"},{"$f":"VLOOKUP($A16,datos!$A$4:$AD$52,3)","v":"Chile"},{"$f":"VLOOKUP($A16,datos!$A$4:$AD$52,4)","v":136},{"$f":"VLOOKUP($A16,datos!$A$4:$AD$52,5)","v":146},{"$f":"VLOOKUP($A16,datos!$A$4:$AD$52,6)","v":136},{"$f":"VLOOKUP($A16,datos!$A$4:$AD$52,7)","v":165},{"$f":"VLOOKUP($A16,datos!$A$4:$AD$52,8)","v":137},{"$f":"VLOOKUP($A16,datos!$A$4:$AD$52,9)","v":134},{"$f":"VLOOKUP($A16,datos!$A$4:$AD$52,10)","v":110},{"$f":"VLOOKUP($A16,datos!$A$4:$AD$52,11)","v":115},{"$f":"VLOOKUP($A16,datos!$A$4:$AD$52,12)","v":120},{"$f":"VLOOKUP($A16,datos!$A$4:$AD$52,13)","v":162},{"$f":"VLOOKUP($A16,datos!$A$4:$AD$52,14)","v":132},{"$f":"VLOOKUP($A16,datos!$A$4:$AD$52,15)","v":154},1647,{"$f":"VLOOKUP($A16,datos!$A$4:$AD$52,16)","v":177},{"$f":"VLOOKUP($A16,datos!$A$4:$AD$52,17)","v":158},{"$f":"VLOOKUP($A16,datos!$A$4:$AD$52,18)","v":122},{"$f":"VLOOKUP($A16,datos!$A$4:$AD$52,19)","v":134},{"$f":"VLOOKUP($A16,datos!$A$4:$AD$52,20)","v":127},{"$f":"VLOOKUP($A16,datos!$A$4:$AD$52,21)","v":155},{"$f":"VLOOKUP($A16,datos!$A$4:$AD$52,22)","v":164},{"$f":"VLOOKUP($A16,datos!$A$4:$AD$52,23)","v":130},{"$f":"VLOOKUP($A16,datos!$A$4:$AD$52,24)","v":131},{"$f":"VLOOKUP($A16,datos!$A$4:$AD$52,25)","v":125},{"$f":"VLOOKUP($A16,datos!$A$4:$AD$52,26)","v":165},{"$f":"VLOOKUP($A16,datos!$A$4:$AD$52,27)","v":184},1772,{"$f":"VLOOKUP($A16,datos!$A$4:$AD$52,28)","v":24},{"$f":"VLOOKUP($A16,datos!$A$4:$AD$52,29)","v":3419},142.45833333333334,"10º",1487]
["J06",{"$f":"VLOOKUP($A17,datos!$A$4:$AD$52,2)","v":"SEBASTIAN VICENCIO R"},{"$f":"VLOOKUP($A17,datos!$A$4:$AD$52,3)","v":"Chile"},{"$f":"VLOOKUP($A17,datos!$A$4:$AD$52,4)","v":121},{"$f":"VLOOKUP($A17,datos!$A$4:$AD$52,5)","v":94},{"$f":"VLOOKUP($A17,datos!$A$4:$AD$52,6)","v":111},{"$f":"VLOOKUP($A17,datos!$A$4:$AD$52,7)","v":125},{"$f":"VLOOKUP($A17,datos!$A$4:$AD$52,8)","v":119},{"$f":"VLOOKUP($A17,datos!$A$4:$AD$52,9)","v":132},{"$f":"VLOOKUP($A17,datos!$A$4:$AD$52,10)","v":152},{"$f":"VLOOKUP($A17,datos!$A$4:$AD$52,11)","v":131},{"$f":"VLOOKUP($A17,datos!$A$4:$AD$52,12)","v":148},{"$f":"VLOOKUP($A17,datos!$A$4:$AD$52,13)","v":145},{"$f":"VLOOKUP($A17,datos!$A$4:$AD$52,14)","v":130},{"$f":"VLOOKUP($A17,datos!$A$4:$AD$52,15)","v":130},1538,{"$f":"VLOOKUP($A17,datos!$A$4:$AD$52,16)","v":100},{"$f":"VLOOKUP($A17,datos!$A$4:$AD$52,17)","v":103},{"$f":"VLOOKUP($A17,datos!$A$4:$AD$52,18)","v":89},{"$f":"VLOOKUP($A17,datos!$A$4:$AD$52,19)","v":127},{"$f":"VLOOKUP($A17,datos!$A$4:$AD$52,20)","v":163},{"$f":"VLOOKUP($A17,datos!$A$4:$AD$52,21)","v":169},{"$f":"VLOOKUP($A17,datos!$A$4:$AD$52,22)","v":122},{"$f":"VLOOKUP($A17,datos!$A$4:$AD$52,23)","v":97},{"$f":"VLOOKUP($A17,datos!$A$4:$AD$52,24)","v":142},{"$f":"VLOOKUP($A17,datos!$A$4:$AD$52,25)","v":147},{"$f":"VLOOKUP($A17,datos!$A$4:$AD$52,26)","v":132},{"$f":"VLOOKUP($A17,datos!$A$4:$AD$52,27)","v":100},1491,{"$f":"VLOOKUP($A17,datos!$A$4:$AD$52,28)","v":24},{"$f":"VLOOKUP($A17,datos!$A$4:$AD$52,29)","v":3029},126.20833333333333,"11º",1877]

{"sheet":"EVENTO PAIS","index":4,"n_rows":27,"n_cols":8,"rows_kept":27,"cut":false,"hidden":false,"merged":[[21,6,22,6],[21,7,22,7],[25,6,26,6],[25,7,26,7],[1,0,1,7],[2,0,2,7],[5,6,6,6],[5,7,6,7],[3,1,3,7],[9,6,10,6],[9,7,10,7],[13,6,14,6],[13,7,14,7],[17,6,18,6],[17,7,18,7]]}
[]
["           CAMPEONATO SUDAMERICANO JUVENIL 2014"]
["     TODO EVENTO PAIS (informativo)"]
[]
["Cod","Nombre del Jugador","FEDERACION","TOTAL PALOS","PROM IND",{"$f":"G6","v":9706},"TOTAL EQ","PROM EQ"]
["J04",{"$f":"VLOOKUP($A6,datos!$A$4:$AD$52,2)","v":"SEBASTIAN SALAZAR"},{"$f":"VLOOKUP($A6,datos!$A$4:$AD$52,3)","v":"Colombia"},{"$f":"VLOOKUP($A6,datos!$A$4:$AD$52,29)","v":4800},{"$f":"D6/24","v":200},{"$f":"G6","v":9706},{"$f":"SUM(D6:D7)","v":9706},{"$f":"SUM(E6:E7)/2","v":202.20833333333331}]
["J05",{"$f":"VLOOKUP($A7,datos!$A$4:$AD$52,2)","v":"MAURICIO CABRERA"},{"$f":"VLOOKUP($A7,datos!$A$4:$AD$52,3)","v":"Colombia"},{"$f":"VLOOKUP($A7,datos!$A$4:$AD$52,29)","v":4906},{"$f":"D7/24","v":204.41666666666666},{"$f":"G6","v":9706}]
[null,null,null,null,null,{"$f":"G6","v":9706}]
["Cod","Nombre del Jugador","FEDERACION","TOT IND","PROM IND",{"$f":"G10","v":9418},"TOTAL EQ","PROM EQ"]
["J08",{"$f":"VLOOKUP($A10,datos!$A$4:$AD$52,2)","v":"ALEJANDRO ISHIKAWA"},{"$f":"VLOOKUP($A10,datos!$A$4:$AD$52,3)","v":"Perú"},{"$f":"VLOOKUP($A10,datos!$A$4:$AD$52,29)","v":4652},{"$f":"D10/24","v":193.83333333333334},{"$f":"G10","v":9418},{"$f":"SUM(D10:D11)","v":9418},{"$f":"SUM(E10:E11)/2","v":196.20833333333334}]
["J09",{"$f":"VLOOKUP($A11,datos!$A$4:$AD$52,2)","v":"SEBASTIAN YUZURIHA"},{"$f":"VLOOKUP($A11,datos!$A$4:$AD$52,3)","v":"Perú"},{"$f":"VLOOKUP($A11,datos!$A$4:$AD$52,29)","v":4766},{"$f":"D11/24","v":198.58333333333334},{"$f":"G10","v":9418}]
[null,null,null,null,null,{"$f":"G10","v":9418}]
["Cod","Nombre del Jugador","FEDERACION","TOTAL PALOS","PROM IND",{"$f":"G14","v":8663},"TOTAL EQ","PROM EQ"]
["J02",{"$f":"VLOOKUP($A14,datos!$A$4:$AD$52,2)","v":"JAIR KELLY"},{"$f":"VLOOKUP($A14,datos!$A$4:$AD$52,3)","v":"Aruba"},{"$f":"VLOOKUP($A14,datos!$A$4:$AD$52,29)","v":4257},{"$f":"D14/24","v":177.375},{"$f":"G14","v":8663},{"$f":"SUM(D14:D15)","v":8663},{"$f":"SUM(E14:E15)/2","v":180.47916666666669}]
["J03",{"$f":"VLOOKUP($A15,datos!$A$4:$AD$52,2)","v":"RENALD THIEL"},{"$f":"VLOOKUP($A15,datos!$A$4:$AD$52,3)","v":"Aruba"},{"$f":"VLOOKUP($A15,datos!$A$4:$AD$52,29)","v":4406},{"$f":"D15/24","v":183.58333333333334},{"$f":"G14","v":8663}]
[null,null,null,null,null,{"$f":"G14","v":8663}]
["Cod","Nombre del Jugador","FEDERACION","TOTAL PALOS","PROM IND",{"$f":"G18","v":7792},"TOTAL EQ","PROM EQ"]
["J10",{"$f":"VLOOKUP($A18,datos!$A$4:$AD$52,2)","v":"FRANCO GARCIA D."},{"$f":"VLOOKUP($A18,datos!$A$4:$AD$52,3)","v":"Uruguay"},{"$f":"VLOOKUP($A18,datos!$A$4:$AD$52,29)","v":3852},{"$f":"D18/24","v":160.5},{"$f":"G18","v":7792},{"$f":"SUM(D18:D19)","v":7792},{"$f":"SUM(E18:E19)/2","v":162.33333333333331}]
["J11",{"$f":"VLOOKUP($A19,datos!$A$4:$AD$52,2)","v":"JOAQUIN MANRIQUE D."},{"$f":"VLOOKUP($A19,datos!$A$4:$AD$52,3)","v":"Uruguay"},{"$f":"VLOOKUP($A19,datos!$A$4:$AD$52,29)","v":3940},{"$f":"D19/24","v":164.16666666666666},{"$f":"G18","v":7792}]
[null,null,null,null,null,{"$f":"G18","v":7792}]
["Cod","Nombre del Jugador","FEDERACION","TOTAL PALOS","PROM IND",{"$f":"G22","v":6448},"TOTAL EQ","PROM EQ"]
["J06",{"$f":"VLOOKUP($A22,datos!$A$4:$AD$52,2)","v":"SEBASTIAN VICENCIO R"},{"$f":"VLOOKUP($A22,datos!$A$4:$AD$52,3)","v":"Chile"},{"$f":"VLOOKUP($A22,datos!$A$4:$AD$52,29)","v":3029},{"$f":"D22/24","v":126.20833333333333},{"$f":"G22","v":6448},{"$f":"SUM(D22:D23)","v":6448},{"$f":"SUM(E22:E23)/2","v":134.33333333333334}]
["J07",{"$f":"VLOOKUP($A23,datos!$A$4:$AD$52,2)","v":"EDUARDO MARTINEZ G"},{"$f":"VLOOKUP($A23,datos!$A$4:$AD$52,3)","v":"Chile"},{"$f":"VLOOKUP($A23,datos!$A$4:$AD$52,29)","v":3419},{"$f":"D23/24","v":142.45833333333334},{"$f":"G22","v":6448}]
[null,null,null,null,null,{"$f":"G22","v":6448}]
["Cod","Nombre del Jugador","FEDERACION","TOTAL PALOS","PROM IND",{"$f":"G26","v":4209},"TOTAL EQ"]
["J01",{"$f":"VLOOKUP($A26,datos!$A$4:$AD$52,2)","v":"JUAN IGNACIO ALI"},{"$f":"VLOOKUP($A26,datos!$A$4:$AD$52,3)","v":"Argentina"},{"$f":"VLOOKUP($A26,datos!$A$4:$AD$52,29)","v":4209},{"$f":"D26/24","v":175.375},{"$f":"G26","v":4209},{"$f":"SUM(D26:D27)","v":4209}]
[null,null,null,null,null,{"$f":"G26","v":4209}]

{"sheet":"Round Robin y Master","index":5,"n_rows":25,"n_cols":20,"rows_kept":25,"cut":false,"hidden":false,"merged":[[16,3,16,5],[16,11,16,13],[16,15,16,19],[17,7,19,9],[25,0,25,1],[20,3,20,5],[20,11,20,13],[20,15,20,19],[22,5,22,9],[23,0,23,1],[24,5,24,9],[22,2,22,3],[24,2,24,3],[0,0,2,1],[0,2,0,16],[0,17,2,19],[1,2,1,16],[2,2,2,16]]}
[null,null,"CAMPEONATO SUDAMERICANO JUVENIL 2014"]
[null,null,"SANTIAGO DE CHILE DEL 12 AL 18 DE ABRIL DE 2014"]
[null,null,"FINAL MASTER SUB 16"]
["DEPORTISTA","PAÍS","TODO E.","LÍNEA 1","BONIF","LÍNEA 2","BONIF","LÍNEA 3","BONIF","LÍNEA 4","BONIF","LÍNEA 5","BONIF","LÍNEA 6","BONIF","LÍNEA 7","BONIF ","TOTAL","DIF.","POSICIÓN"]
["MAURICIO CABRERA","Colombia",4906,183,20,143,0,211,20,226,20,232,20,181,0,214,20,{"$f":"D5+E5+F5+G5+H5+I5+J5+K5+L5+M5+N5+O5+P5+Q5+C5","v":6396},{"$f":"R5-R5","v":0},"1°"]
["SEBASTIAN SALAZAR","Colombia",4800,155,0,205,20,201,20,212,20,187,0,204,20,215,20,6279,{"$f":"R5-R6","v":117},"2°"]
["SEBASTIAN YUZURIHA","Perú",4766,214,20,212,20,168,0,166,20,246,20,216,20,168,20,6276,{"$f":"R5-R7","v":120},"3°"]
["ALEJANDRO ISHIKAWA","Perú",4652,192,0,151,0,205,0,198,0,210,20,201,20,219,0,6068,{"$f":"R5-R8","v":328},"4°"]
["RENALD THIEL","Aruba",4406,211,20,179,20,178,20,241,20,237,20,161,0,204,0,5917,{"$f":"R5-R9","v":479},"5°"]
["JAIR KELLY","Aruba",4257,128,0,176,20,124,0,180,0,147,0,222,20,236,20,5530,{"$f":"R5-R10","v":866},"6°"]
["JUAN IGNACIO ALI","Argentina",4209,162,0,161,0,178,20,157,0,188,0,173,0,171,0,5419,{"$f":"R5-R11","v":977},"7°"]
["JOAQUIN MANRIQUE D.","Uruguay",3940,167,20,124,0,170,0,161,0,151,0,183,0,159,0,5075,{"$f":"R5-R12","v":1321},"8°"]
[]
[]
[]
["MAURICIO CABRERA",251]
["1° VS 4°",null,null,"MAURICIO CABRERA",null,null,"G1",null,171,null,null,"CAMPEÓN",null,null,null,"SEBASTIÁN YUZURIHA"]
["ALEJANDRO ISHIKAWA",189,null,null,null,null,null,"G1 VS G2"]
[]
["SEBASTIAN SALAZAR",189]
["2° VS 3°",null,null,"SEBASTIÁN YUZURIHA",null,null,"G2",null,192,null,null,"SUBCAMPEÓN",null,null,null,"MAURICIO CABRERA"]
["SEBASTIAN YUZURIHA",215]
["TERCERO",null,"BRONCE",null,null,"SEBASTIÁN SALAZAR"]
[]
["TERCERO",null,"BRONCE",null,null,"ALEJANDRO ISHIKAWA"]