{"text_format":"1","workbook":"xlsx","n_sheets":6,"sheets":["datos","IND.","PAR","T EVENTO","EVENTO PAIS","Round Robin y Master"],"not_rendered":{"charts":0,"images":6,"macros":1,"external_links":0,"defined_names":7,"comments":0,"pivot_tables":0},"unopened":[],"bounds":{"document_bytes":16777216,"sheet_cells":100000,"rows_first":2000,"rows_last":500,"rows_between":2000,"halvings":0,"cell_chars":16384,"cell_head_chars":4096},"cells_cut":0,"cells_raw":0,"read":"whole","date_system":"1900"}

{"sheet":"datos","index":0,"n_rows":53,"n_cols":30,"rows_kept":53,"cut":false,"hidden":true,"merged":[]}
[null,"solamente carga de datos"]
[null,null,null,null,null,null,null,null,null,null,null,null,null,null,null,null,null," "]
[null,"Apellido y Nombre","FEDE","L1","L2","L3","L4","L5","L6","L7","L8","L9","L10","L11","L12","L13","L14","L15","L16","L17","L18","L19","L20","L21","L22","L23","L24","LIN","TOTAL","PROM"]
["J01","JUAN IGNACIO ALI","Argentina",171,182,177,157,160,202,179,166,170,180,190,180,162,182,168,167,201,155,175,163,167,166,173,216,{"$f":"COUNTIF(D4:AA4,\">0\")","v":24},{"$f":"SUM(D4:AA4)","v":4209},{"$f":"AC4/AB4","v":175.375}]
["J02","JAIR KELLY","Aruba",118,147,188,211,199,146,204,141,124,232,166,162,121,134,158,237,199,200,179,216,169,192,187,227,24,4257,{"$f":"AC5/AB5","v":177.375}]
["J03","RENALD THIEL","Aruba",213,160,173,214,194,202,204,191,221,187,188,170,170,150,192,201,229,157,108,158,175,206,200,143,24,4406,183.58333333333334]
["J04","SEBASTIAN SALAZAR","Colombia",213,222,159,211,233,145,194,170,203,211,158,180,256,278,204,194,238,178,218,168,201,190,158,218,24,4800,200]
["J05","MAURICIO CABRERA","Colombia",257,212,213,188,191,161,191,190,171,190,228,180,189,227,235,187,222,213,232,181,216,224,233,175,24,4906,204.41666666666666]
["J06","SEBASTIAN VICENCIO R","Chile",121,94,111,125,119,132,152,131,148,145,130,130,100,103,89,127,163,169,122,97,142,147,132,100,24,3029,126.20833333333333]
["J07","EDUARDO MARTINEZ G","Chile",136,146,136,165,137,134,110,115,120,162,132,154,177,158,122,134,127,155,164,130,131,125,165,184,24,3419,142.45833333333334]
{"$rows_left_out":44}
{"sheet":"IND.","index":1,"n_rows":16,"n_cols":20,"rows_kept":16,"cut":false,"hidden":false,"merged":[[3,1,3,19],[1,0,1,19],[2,0,2,19]]}
[]
["CAMPEONATO SUDAMERICANO JUVENIL 2014"]
["INDVIDUAL SUB 16"]
[]
["Cod","Nombre del Jugador","FEDERACION","L1","L2","L3","L4","L5","L6","L7","L8","L9","L10","L11","L12","total","lin","Prom","Pos.","dif"]
["J05",{"$f":"VLOOKUP($A6,datos!$A$4:$AD$52,2)","v":"MAURICIO CABRERA"},{"$f":"VLOOKUP($A6,datos!$A$4:$AD$52,3)","v":"Colombia"},{"$f":"VLOOKUP($A6,datos!$A$4:$AD$52,4)","v":257},{"$f":"VLOOKUP($A6,datos!$A$4:$AD$52,5)","v":212},{"$f":"VLOOKUP($A6,datos!$A$4:$AD$52,6)","v":213},{"$f":"VLOOKUP($A6,datos!$A$4:$AD$52,7)","v":188},{"$f":"VLOOKUP($A6,datos!$A$4:$AD$52,8)","v":191},{"$f":"VLOOKUP($A6,datos!$A$4:$AD$52,9)","v":161},{"$f":"VLOOKUP($A6,datos!$A$4:$AD$52,10)","v":191},{"$f":"VLOOKUP($A6,datos!$A$4:$AD$52,11)","v":190},{"$f":"VLOOKUP($A6,datos!$A$4:$AD$52,12)","v":171},{"$f":"VLOOKUP($A6,datos!$A$4:$AD$52,13)","v":190},{"$f":"VLOOKUP($A6,datos!$A$4:$AD$52,14)","v":228},{"$f":"VLOOKUP($A6,datos!$A$4:$AD$52,15)","v":180},{"$f":"SUM(D6:O6)","v":2372},{"$f":"COUNTIF(D6:O6,\">0\")","v":12},{"$f":"P6/Q6","v":197.66666666666666},"1º",{"$f":"MAX($P$6:$P$16)-P6","v":0}]
["J09",{"$f":"VLOOKUP($A7,datos!$A$4:$AD$52,2)","v":"SEBASTIAN YUZURIHA"},{"$f":"VLOOKUP($A7,datos!$A$4:$AD$52,3)","v":"Perú"},{"$f":"VLOOKUP($A7,datos!$A$4:$AD$52,4)","v":155},{"$f":"VLOOKUP($A7,datos!$A$4:$AD$52,5)","v":168},{"$f":"VLOOKUP($A7,datos!$A$4:$AD$52,6)","v":201},{"$f":"VLOOKUP($A7,datos!$A$4:$AD$52,7)","v":264},{"$f":"VLOOKUP($A7,datos!$A$4:$AD$52,8)","v":277},{"$f":"VLOOKUP($A7,datos!$A$4:$AD$52,9)","v":205},{"$f":"VLOOKUP($A7,datos!$A$4:$AD$52,10)","v":189},{"$f":"VLOOKUP($A7,datos!$A$4:$AD$52,11)","v":200},{"$f":"VLOOKUP($A7,datos!$A$4:$AD$52,12)","v":153},{"$f":"VLOOKUP($A7,datos!$A$4:$AD$52,13)","v":182},{"$f":"VLOOKUP($A7,datos!$A$4:$AD$52,14)","v":168},{"$f":"VLOOKUP($A7,datos!$A$4:$AD$52,15)","v":184},2346,{"$f":"COUNTIF(D7:O7,\">0\")","v":12},{"$f":"P7/Q7","v":195.5},"2º",26]
["J03",{"$f":"VLOOKUP($A8,datos!$A$4:$AD$52,2)","v":"RENALD THIEL"},{"$f":"VLOOKUP($A8,datos!$A$4:$AD$52,3)","v":"Aruba"},{"$f":"VLOOKUP($A8,datos!$A$4:$AD$52,4)","v":213},{"$f":"VLOOKUP($A8,datos!$A$4:$AD$52,5)","v":160},{"$f":"VLOOKUP($A8,datos!$A$4:$AD$52,6)","v":173},{"$f":"VLOOKUP($A8,datos!$A$4:$AD$52,7)","v":214},{"$f":"VLOOKUP($A8,datos!$A$4:$AD$52,8)","v":194},{"$f":"VLOOKUP($A8,datos!$A$4:$AD$52,9)","v":202},{"$f":"VLOOKUP($A8,datos!$A$4:$AD$52,10)","v":204},{"$f":"VLOOKUP($A8,datos!$A$4:$AD$52,11)","v":191},{"$f":"VLOOKUP($A8,datos!$A$4:$AD$52,12)","v":221},{"$f":"VLOOKUP($A8,datos!$A$4:$AD$52,13)","v":187},{"$f":"VLOOKUP($A8,datos!$A$4:$AD$52,14)","v":188},{"$f":"VLOOKUP($A8,datos!$A$4:$AD$52,15)","v":170},2317,12,193.08333333333334,"3º",55]
["J04",{"$f":"VLOOKUP($A9,datos!$A$4:$AD$52,2)","v":"SEBASTIAN SALAZAR"},{"$f":"VLOOKUP($A9,datos!$A$4:$AD$52,3)","v":"Colombia"},{"$f":"VLOOKUP($A9,datos!$A$4:$AD$52,4)","v":213},{"$f":"VLOOKUP($A9,datos!$A$4:$AD$52,5)","v":222},{"$f":"VLOOKUP($A9,datos!$A$4:$AD$52,6)","v":159},{"$f":"VLOOKUP($A9,datos!$A$4:$AD$52,7)","v":211},{"$f":"VLOOKUP($A9,datos!$A$4:$AD$52,8)","v":233},{"$f":"VLOOKUP($A9,datos!$A$4:$AD$52,9)","v":145},{"$f":"VLOOKUP($A9,datos!$A$4:$AD$52,10)","v":194},{"$f":"VLOOKUP($A9,datos!$A$4:$AD$52,11)","v":170},{"$f":"VLOOKUP($A9,datos!$A$4:$AD$52,12)","v":203},{"$f":"VLOOKUP($A9,datos!$A$4:$AD$52,13)","v":211},{"$f":"VLOOKUP($A9,datos!$A$4:$AD$52,14)","v":158},{"$f":"VLOOKUP($A9,datos!$A$4:$AD$52,15)","v":180},2299,12,191.58333333333334,"4º",73]
["J08",{"$f":"VLOOKUP($A10,datos!$A$4:$AD$52,2)","v":"ALEJANDRO ISHIKAWA"},{"$f":"VLOOKUP($A10,datos!$A$4:$AD$52,3)","v":"Perú"},{"$f":"VLOOKUP($A10,datos!$A$4:$AD$52,4)","v":166},{"$f":"VLOOKUP($A10,datos!$A$4:$AD$52,5)","v":179},{"$f":"VLOOKUP($A10,datos!$A$4:$AD$52,6)","v":214},{"$f":"VLOOKUP($A10,datos!$A$4:$AD$52,7)","v":188},{"$f":"VLOOKUP($A10,datos!$A$4:$AD$52,8)","v":228},{"$f":"VLOOKUP($A10,datos!$A$4:$AD$52,9)","v":195},{"$f":"VLOOKUP($A10,datos!$A$4:$AD$52,10)","v":141},{"$f":"VLOOKUP($A10,datos!$A$4:$AD$52,11)","v":237},{"$f":"VLOOKUP($A10,datos!$A$4:$AD$52,12)","v":165},{"$f":"VLOOKUP($A10,datos!$A$4:$AD$52,13)","v":179},{"$f":"VLOOKUP($A10,datos!$A$4:$AD$52,14)","v":160},{"$f":"VLOOKUP($A10,datos!$A$4:$AD$52,15)","v":170},2222,12,185.16666666666666,"5º",150]
{"$rows_left_out":7}
{"sheet":"PAR","index":2,"n_rows":31,"n_cols":22,"rows_kept":31,"cut":false,"hidden":false,"merged":[[16,19,17,19],[21,19,22,19],[26,19,27,19],[1,0,1,19],[2,0,2,19],[11,19,12,19],[3,1,3,19],[6,19,7,19]]}
[]
["                        CAMPEONATO SUDAMERICANO JUVENIL 2014"]
["                  DOBLES  SUB 16"]
[]
["Cod","Nombre del Jugador","FEDERACION","L1","L2","L3","L4","L5","L6","L7","L8","L9","L10","L11","L12","Serie",null,{"$f":"S8","v":419.58333333333331},"Prom","dif"]
["J04",{"$f":"VLOOKUP($A6,datos!$A$4:$AD$52,2)","v":"SEBASTIAN SALAZAR"},{"$f":"VLOOKUP($A6,datos!$A$4:$AD$52,3)","v":"Colombia"},{"$f":"VLOOKUP($A6,datos!$A$4:$AD$52,16)","v":256},{"$f":"VLOOKUP($A6,datos!$A$4:$AD$52,17)","v":278},{"$f":"VLOOKUP($A6,datos!$A$4:$AD$52,18)","v":204},{"$f":"VLOOKUP($A6,datos!$A$4:$AD$52,19)","v":194},{"$f":"VLOOKUP($A6,datos!$A$4:$AD$52,20)","v":238},{"$f":"VLOOKUP($A6,datos!$A$4:$AD$52,21)","v":178},{"$f":"VLOOKUP($A6,datos!$A$4:$AD$52,22)","v":218},{"$f":"VLOOKUP($A6,datos!$A$4:$AD$52,23)","v":168},{"$f":"VLOOKUP($A6,datos!$A$4:$AD$52,24)","v":201},{"$f":"VLOOKUP($A6,datos!$A$4:$AD$52,25)","v":190},{"$f":"VLOOKUP($A6,datos!$A$4:$AD$52,26)","v":158},{"$f":"VLOOKUP($A6,datos!$A$4:$AD$52,27)","v":218},{"$f":"SUM(D6:O6)","v":2501},{"$f":"(COUNTIF(D6:I6,\">0\"))","v":6},{"$f":"S8","v":419.58333333333331},{"$f":"P6/Q6","v":416.83333333333331},{"$f":"$P$8-P8","v":0}]
["J05",{"$f":"VLOOKUP($A7,datos!$A$4:$AD$52,2)","v":"MAURICIO CABRERA"},{"$f":"VLOOKUP($A7,datos!$A$4:$AD$52,3)","v":"Colombia"},{"$f":"VLOOKUP($A7,datos!$A$4:$AD$52,16)","v":189},{"$f":"VLOOKUP($A7,datos!$A$4:$AD$52,17)","v":227},{"$f":"VLOOKUP($A7,datos!$A$4:$AD$52,18)","v":235},{"$f":"VLOOKUP($A7,datos!$A$4:$AD$52,19)","v":187},{"$f":"VLOOKUP($A7,datos!$A$4:$AD$52,20)","v":222},{"$f":"VLOOKUP($A7,datos!$A$4:$AD$52,21)","v":213},{"$f":"VLOOKUP($A7,datos!$A$4:$AD$52,22)","v":232},{"$f":"VLOOKUP($A7,datos!$A$4:$AD$52,23)","v":181},{"$f":"VLOOKUP($A7,datos!$A$4:$AD$52,24)","v":216},{"$f":"VLOOKUP($A7,datos!$A$4:$AD$52,25)","v":224},{"$f":"VLOOKUP($A7,datos!$A$4:$AD$52,26)","v":233},{"$f":"VLOOKUP($A7,datos!$A$4:$AD$52,27)","v":175},{"$f":"SUM(D7:O7)","v":2534},{"$f":"(COUNTIF(D7:I7,\">0\"))","v":6},{"$f":"S8","v":419.58333333333331},{"$f":"P7/Q7","v":422.33333333333331},"1°"]
[null,null,null,{"$f":"SUM(D6:D7)","v":445},505,439,381,460,391,450,349,417,414,391,393,5035,{"$f":"(COUNTIF(D8:I8,\">0\"))*2","v":12},{"$f":"S8","v":419.58333333333331},{"$f":"P8/Q8","v":419.58333333333331},null,null,{"$f":"MAX(D8:I8)","v":505}]
[null,null,null,null,null,null,null,null,null,null,null,null,null,null,null,null,null,{"$f":"S8","v":419.58333333333331}]
["Cod","Nombre del Jugador","FEDERACION","L1","L2","L3","L4","L5","L6","L7","L8","L9","L10","L11","L12","Serie",null,{"$f":"S13","v":404.16666666666669},"Prom","dif"]
{"$rows_left_out":22}
{"sheet":"T EVENTO","index":3,"n_rows":17,"n_cols":34,"rows_kept":17,"cut":false,"hidden":false,"merged":[[4,3,4,8],[4,9,4,15],[4,22,4,28],[4,16,4,21],[1,0,1,32],[2,0,2,32],[3,0,3,32]]}
[]
["CAMPEONATO SUDAMERICANO JUVENIL 2014"]
["TODO EVENTO INDIVIDUAL"]
["SANTIAGO DE CHILE - DEL 12 AL 18 DE ABRIL DE 2014"]
[null,null,null,"IND. S1",null,null,null,null,null,"INDIVIDUAL 12L",null,null,null,null,null,null,"DOBLES S1",null,null,null,null,null,"DOBLES 12L"]
["Cod","Nombre del Jugador","FEDERACION","L1","L2","L3","L4","L5","L6","L7","L8","L9","L10","L11","L12","Serie","L13","L14","L15","L16","L17","L18","L19","L20","L21","L22","L23","L24","Serie","L","Total","Prom","Pos.","dif"]
["J05",{"$f":"VLOOKUP($A7,datos!$A$4:$AD$52,2)","v":"MAURICIO CABRERA"},{"$f":"VLOOKUP($A7,datos!$A$4:$AD$52,3)","v":"Colombia"},{"$f":"VLOOKUP($A7,datos!$A$4:$AD$52,4)","v":257},{"$f":"VLOOKUP($A7,datos!$A$4:$AD$52,5)","v":212},{"$f":"VLOOKUP($A7,datos!$A$4:$AD$52,6)","v":213},{"$f":"VLOOKUP($A7,datos!$A$4:$AD$52,7)","v":188},{"$f":"VLOOKUP($A7,datos!$A$4:$AD$52,8)","v":191},{"$f":"VLOOKUP($A7,datos!$A$4:$AD$52,9)","v":161},{"$f":"VLOOKUP($A7,datos!$A$4:$AD$52,10)","v":191},{"$f":"VLOOKUP($A7,datos!$A$4:$AD$52,11)","v":190},{"$f":"VLOOKUP($A7,datos!$A$4:$AD$52,12)","v":171},{"$f":"VLOOKUP($A7,datos!$A$4:$AD$52,13)","v":190},{"$f":"VLOOKUP($A7,datos!$A$4:$AD$52,14)","v":228},{"$f":"VLOOKUP($A7,datos!$A$4:$AD$52,15)","v":180},{"$f":"SUM(D7:O7)","v":2372},{"$f":"VLOOKUP($A7,datos!$A$4:$AD$52,16)","v":189},{"$f":"VLOOKUP($A7,datos!$A$4:$AD$52,17)","v":227},{"$f":"VLOOKUP($A7,datos!$A$4:$AD$52,18)","v":235},{"$f":"VLOOKUP($A7,datos!$A$4:$AD$52,19)","v":187},{"$f":"VLOOKUP($A7,datos!$A$4:$AD$52,20)","v":222},{"$f":"VLOOKUP($A7,datos!$A$4:$AD$52,21)","v":213},{"$f":"VLOOKUP($A7,datos!$A$4:$AD$52,22)","v":232},{"$f":"VLOOKUP($A7,datos!$A$4:$AD$52,23)","v":181},{"$f":"VLOOKUP($A7,datos!$A$4:$AD$52,24)","v":216},{"$f":"VLOOKUP($A7,datos!$A$4:$AD$52,25)","v":224},{"$f":"VLOOKUP($A7,datos!$A$4:$AD$52,26)","v":233},{"$f":"VLOOKUP($A7,datos!$A$4:$AD$52,27)","v":175},{"$f":"SUM(Q7:AB7)","v":2534},{"$f":"VLOOKUP($A7,datos!$A$4:$AD$52,28)","v":24},{"$f":"VLOOKUP($A7,datos!$A$4:$AD$52,29)","v":4906},{"$f":"AE7/AD7","v":204.41666666666666},"1º",{"$f":"MAX($AE$7:$AE$17)-AE7","v":0}]
["J04",{"$f":"VLOOKUP($A8,datos!$A$4:$AD$52,2)","v":"SEBASTIAN SALAZAR"},{"$f":"VLOOKUP($A8,datos!$A$4:$AD$52,3)","v":"Colombia"},{"$f":"VLOOKUP($A8,datos!$A$4:$AD$52,4)","v":213},{"$f":"VLOOKUP($A8,datos!$A$4:$AD$52,5)","v":222},{"$f":"VLOOKUP($A8,datos!$A$4:$AD$52,6)","v":159},{"$f":"VLOOKUP($A8,datos!$A$4:$AD$52,7)","v":211},{"$f":"VLOOKUP($A8,datos!$A$4:$AD$52,8)","v":233},{"$f":"VLOOKUP($A8,datos!$A$4:$AD$52,9)","v":145},{"$f":"VLOOKUP($A8,datos!$A$4:$AD$52,10)","v":194},{"$f":"VLOOKUP($A8,datos!$A$4:$AD$52,11)","v":170},{"$f":"VLOOKUP($A8,datos!$A$4:$AD$52,12)","v":203},{"$f":"VLOOKUP($A8,datos!$A$4:$AD$52,13)","v":211},{"$f":"VLOOKUP($A8,datos!$A$4:$AD$52,14)","v":158},{"$f":"VLOOKUP($A8,datos!$A$4:$AD$52,15)","v":180},2299,{"$f":"VLOOKUP($A8,datos!$A$4:$AD$52,16)","v":256},{"$f":"VLOOKUP($A8,datos!$A$4:$AD$52,17)","v":278},{"$f":"VLOOKUP($A8,datos!$A$4:$AD$52,18)","v":204},{"$f":"VLOOKUP($A8,datos!$A$4:$AD$52,19)","v":194},{"$f":"VLOOKUP($A8,datos!$A$4:$AD$52,20)","v":238},{"$f":"VLOOKUP($A8,datos!$A$4:$AD$52,21)","v":178},{"$f":"VLOOKUP($A8,datos!$A$4:$AD$52,22)","v":218},{"$f":"VLOOKUP($A8,datos!$A$4:$AD$52,23)","v":168},{"$f":"VLOOKUP($A8,datos!$A$4:$AD$52,24)","v":201},{"$f":"VLOOKUP($A8,datos!$A$4:$AD$52,25)","v":190},{"$f":"VLOOKUP($A8,datos!$A$4:$AD$52,26)","v":158},{"$f":"VLOOKUP($A8,datos!$A$4:$AD$52,27)","v":218},2501,{"$f":"VLOOKUP($A8,datos!$A$4:$AD$52,28)","v":24},{"$f":"VLOOKUP($A8,datos!$A$4:$AD$52,29)","v":4800},200,"2º",106]
["J09",{"$f":"VLOOKUP($A9,datos!$A$4:$AD$52,2)","v":"SEBASTIAN YUZURIHA"},{"$f":"VLOOKUP($A9,datos!$A$4:$AD$52,3)","v":"Perú"},{"$f":"VLOOKUP($A9,datos!$A$4:$AD$52,4)","v":155},{"$f":"VLOOKUP($A9,datos!$A$4:$AD$52,5)","v":168},{"$f":"VLOOKUP($A9,datos!$A$4:$AD$52,6)","v":201},{"$f":"VLOOKUP($A9,datos!$A$4:$AD$52,7)","v":264},{"$f":"VLOOKUP($A9,datos!$A$4:$AD$52,8)","v":277},{"$f":"VLOOKUP($A9,datos!$A$4:$AD$52,9)","v":205},{"$f":"VLOOKUP($A9,datos!$A$4:$AD$52,10)","v":189},{"$f":"VLOOKUP($A9,datos!$A$4:$AD$52,11)","v":200},{"$f":"VLOOKUP($A9,datos!$A$4:$AD$52,12)","v":153},{"$f":"VLOOKUP($A9,datos!$A$4:$AD$52,13)","v":182},{"$f":"VLOOKUP($A9,datos!$A$4:$AD$52,14)","v":168},{"$f":"VLOOKUP($A9,datos!$A$4:$AD$52,15)","v":184},2346,{"$f":"VLOOKUP($A9,datos!$A$4:$AD$52,16)","v":206},{"$f":"VLOOKUP($A9,datos!$A$4:$AD$52,17)","v":188},{"$f":"VLOOKUP($A9,datos!$A$4:$AD$52,18)","v":171},{"$f":"VLOOKUP($A9,datos!$A$4:$AD$52,19)","v":211},{"$f":"VLOOKUP($A9,datos!$A$4:$AD$52,20)","v":219},{"$f":"VLOOKUP($A9,datos!$A$4:$AD$52,21)","v":199},{"$f":"VLOOKUP($A9,datos!$A$4:$AD$52,22)","v":227},{"$f":"VLOOKUP($A9,datos!$A$4:$AD$52,23)","v":152},{"$f":"VLOOKUP($A9,datos!$A$4:$AD$52,24)","v":169},{"$f":"VLOOKUP($A9,datos!$A$4:$AD$52,25)","v":213},{"$f":"VLOOKUP($A9,datos!$A$4:$AD$52,26)","v":223},{"$f":"VLOOKUP($A9,datos!$A$4:$AD$52,27)","v":242},2420,{"$f":"VLOOKUP($A9,datos!$A$4:$AD$52,28)","v":24},{"$f":"VLOOKUP($A9,datos!$A$4:$AD$52,29)","v":4766},198.58333333333334,"3º",140]
["J08",{"$f":"VLOOKUP($A10,datos!$A$4:$AD$52,2)","v":"ALEJANDRO ISHIKAWA"},{"$f":"VLOOKUP($A10,datos!$A$4:$AD$52,3)","v":"Perú"},{"$f":"VLOOKUP($A10,datos!$A$4:$AD$52,4)","v":166},{"$f":"VLOOKUP($A10,datos!$A$4:$AD$52,5)","v":179},{"$f":"VLOOKUP($A10,datos!$A$4:$AD$52,6)","v":214},{"$f":"VLOOKUP($A10,datos!$A$4:$AD$52,7)","v":188},{"$f":"VLOOKUP($A10,datos!$A$4:$AD$52,8)","v":228},{"$f":"VLOOKUP($A10,datos!$A$4:$AD$52,9)","v":195},{"$f":"VLOOKUP($A10,datos!$A$4:$AD$52,10)","v":141},{"$f":"VLOOKUP($A10,datos!$A$4:$AD$52,11)","v":237},{"$f":"VLOOKUP($A10,datos!$A$4:$AD$52,12)","v":165},{"$f":"VLOOKUP($A10,datos!$A$4:$AD$52,13)","v":179},{"$f":"VLOOKUP($A10,datos!$A$4:$AD$52,14)","v":160},{"$f":"VLOOKUP($A10,datos!$A$4:$AD$52,15)","v":170},2222,{"$f":"VLOOKUP($A10,datos!$A$4:$AD$52,16)","v":233},{"$f":"VLOOKUP($A10,datos!$A$4:$AD$52,17)","v":204},{"$f":"VLOOKUP($A10,datos!$A$4:$AD$52,18)","v":222},{"$f":"VLOOKUP($A10,datos!$A$4:$AD$52,19)","v":211},{"$f":"VLOOKUP($A10,datos!$A$4:$AD$52,20)","v":180},{"$f":"VLOOKUP($A10,datos!$A$4:$AD$52,21)","v":187},{"$f":"VLOOKUP($A10,datos!$A$4:$AD$52,22)","v":144},{"$f":"VLOOKUP($A10,datos!$A$4:$AD$52,23)","v":258},{"$f":"VLOOKUP($A10,datos!$A$4:$AD$52,24)","v":178},{"$f":"VLOOKUP($A10,datos!$A$4:$AD$52,25)","v":162},{"$f":"VLOOKUP($A10,datos!$A$4:$AD$52,26)","v":290},{"$f":"VLOOKUP($A10,datos!$A$4:$AD$52,27)","v":161},2430,{"$f":"VLOOKUP($A10,datos!$A$4:$AD$52,28)","v":24},{"$f":"VLOOKUP($A10,datos!$A$4:$AD$52,29)","v":4652},193.83333333333334,"4º",254]
{"$rows_left_out":8}
{"sheet":"EVENTO PAIS","index":4,"n_rows":27,"n_cols":8,"rows_kept":27,"cut":false,"hidden":false,"merged":[[21,6,22,6],[21,7,22,7],[25,6,26,6],[25,7,26,7],[1,0,1,7],[2,0,2,7],[5,6,6,6],[5,7,6,7],[3,1,3,7],[9,6,10,6],[9,7,10,7],[13,6,14,6],[13,7,14,7],[17,6,18,6],[17,7,18,7]]}
[]
["           CAMPEONATO SUDAMERICANO JUVENIL 2014"]
["     TODO EVENTO PAIS (informativo)"]
[]
["Cod","Nombre del Jugador","FEDERACION","TOTAL PALOS","PROM IND",{"$f":"G6","v":9706},"TOTAL EQ","PROM EQ"]
["J04",{"$f":"VLOOKUP($A6,datos!$A$4:$AD$52,2)","v":"SEBASTIAN SALAZAR"},{"$f":"VLOOKUP($A6,datos!$A$4:$AD$52,3)","v":"Colombia"},{"$f":"VLOOKUP($A6,datos!$A$4:$AD$52,29)","v":4800},{"$f":"D6/24","v":200},{"$f":"G6","v":9706},{"$f":"SUM(D6:D7)","v":9706},{"$f":"SUM(E6:E7)/2","v":202.20833333333331}]
["J05",{"$f":"VLOOKUP($A7,datos!$A$4:$AD$52,2)","v":"MAURICIO CABRERA"},{"$f":"VLOOKUP($A7,datos!$A$4:$AD$52,3)","v":"Colombia"},{"$f":"VLOOKUP($A7,datos!$A$4:$AD$52,29)","v":4906},{"$f":"D7/24","v":204.41666666666666},{"$f":"G6","v":9706}]
[null,null,null,null,null,{"$f":"G6","v":9706}]
["Cod","Nombre del Jugador","FEDERACION","TOT IND","PROM IND",{"$f":"G10","v":9418},"TOTAL EQ","PROM EQ"]
["J08",{"$f":"VLOOKUP($A10,datos!$A$4:$AD$52,2)","v":"ALEJANDRO ISHIKAWA"},{"$f":"VLOOKUP($A10,datos!$A$4:$AD$52,3)","v":"Perú"},{"$f":"VLOOKUP($A10,datos!$A$4:$AD$52,29)","v":4652},{"$f":"D10/24","v":193.83333333333334},{"$f":"G10","v":9418},{"$f":"SUM(D10:D11)","v":9418},{"$f":"SUM(E10:E11)/2","v":196.20833333333334}]
{"$rows_left_out":18}
{"sheet":"Round Robin y Master","index":5,"n_rows":25,"n_cols":20,"rows_kept":25,"cut":false,"hidden":false,"merged":[[16,3,16,5],[16,11,16,13],[16,15,16,19],[17,7,19,9],[25,0,25,1],[20,3,20,5],[20,11,20,13],[20,15,20,19],[22,5,22,9],[23,0,23,1],[24,5,24,9],[22,2,22,3],[24,2,24,3],[0,0,2,1],[0,2,0,16],[0,17,2,19],[1,2,1,16],[2,2,2,16]]}
[null,null,"CAMPEONATO SUDAMERICANO JUVENIL 2014"]
[null,null,"SANTIAGO DE CHILE DEL 12 AL 18 DE ABRIL DE 2014"]
[null,null,"FINAL MASTER SUB 16"]
["DEPORTISTA","PAÍS","TODO E.","LÍNEA 1","BONIF","LÍNEA 2","BONIF","LÍNEA 3","BONIF","LÍNEA 4","BONIF","LÍNEA 5","BONIF","LÍNEA 6","BONIF","LÍNEA 7","BONIF ","TOTAL","DIF.","POSICIÓN"]
["MAURICIO CABRERA","Colombia",4906,183,20,143,0,211,20,226,20,232,20,181,0,214,20,{"$f":"D5+E5+F5+G5+H5+I5+J5+K5+L5+M5+N5+O5+P5+Q5+C5","v":6396},{"$f":"R5-R5","v":0},"1°"]
["SEBASTIAN SALAZAR","Colombia",4800,155,0,205,20,201,20,212,20,187,0,204,20,215,20,6279,{"$f":"R5-R6","v":117},"2°"]
["SEBASTIAN YUZURIHA","Perú",4766,214,20,212,20,168,0,166,20,246,20,216,20,168,20,6276,{"$f":"R5-R7","v":120},"3°"]
["ALEJANDRO ISHIKAWA","Perú",4652,192,0,151,0,205,0,198,0,210,20,201,20,219,0,6068,{"$f":"R5-R8","v":328},"4°"]
["RENALD THIEL","Aruba",4406,211,20,179,20,178,20,241,20,237,20,161,0,204,0,5917,{"$f":"R5-R9","v":479},"5°"]
["JAIR KELLY","Aruba",4257,128,0,176,20,124,0,180,0,147,0,222,20,236,20,5530,{"$f":"R5-R10","v":866},"6°"]
{"$rows_left_out":15}